{"text_format":"1","workbook":"xlsx","n_sheets":12,"sheets":["Select an authority","CP conferences","CP registrations","CP de-registrations","CP on register","DATA CP CON","DATA CP REG","DATA CP DEREG","DATA CP ON REG","REF EA Name","REF CAS2","REF CAs"],"not_rendered":{"charts":4,"images":0,"macros":1,"external_links":0,"defined_names":4,"comments":0,"pivot_tables":0},"unopened":[],"bounds":{"document_bytes":16777216,"sheet_cells":100000,"rows_first":2000,"rows_last":500,"rows_between":2000,"halvings":0,"cell_chars":16384,"cell_head_chars":4096},"cells_cut":0,"cells_raw":0,"read":"whole","date_system":"1900"}

{"sheet":"Select an authority","index":0,"n_rows":33,"n_cols":5,"rows_kept":33,"cut":false,"hidden":false,"merged":[[27,3,30,8],[10,0,11,8],[12,0,17,8]]}
[15]
["Selecting an Authority and its Standard Comparator Authorities"]
["PLEASE REMEMBER TO 'ENABLE MACROS' - ",null,null,null,"Please select a Local Authority:"]
["THEY MAY HAVE BEEN DISABLED."]
["Last updated: 24/09/2020"]
[]
["Instructions on how to use this workbook available at:-"]
["LA Level Statistics - Child Protection - User Instructions"]
["Child Protection publications can be found at:-"]
["Children's Social Work Statistics"]
{"$rows_left_out":24}
{"sheet":"CP conferences","index":1,"n_rows":50,"n_cols":30,"rows_kept":50,"cut":false,"hidden":false,"merged":[[11,1,12,6],[13,1,14,6],[15,1,17,6]]}
[{"$f":"'DATA CP CON'!A1","v":"Child Protection: Conferences: 31 July 2013-2019"}]
[null,null,"select comparators:"]
[null,{"$f":"J3","v":8},null,null,null,null,null,null,null,{"$f":"VLOOKUP('Select an authority'!$A$1,'REF CAs'!$A$1:$F$32,2,0)","v":8}]
[null,{"$f":"J4","v":31},null,null,null,null,null,null,null,{"$f":"VLOOKUP('Select an authority'!$A$1,'REF CAs'!$A$1:$F$32,3,0)","v":31}]
[null,{"$f":"J5","v":17},null,null,null,null,null,null,null,{"$f":"VLOOKUP('Select an authority'!$A$1,'REF CAs'!$A$1:$F$32,4,0)","v":17}]
[null,1,null,null,null,null,null,null,null,{"$f":"VLOOKUP('Select an authority'!$A$1,'REF CAs'!$A$1:$F$32,5,0)","v":1}]
[null,25,null,null,null,null,null,null,null,{"$f":"VLOOKUP('Select an authority'!$A$1,'REF CAs'!$A$1:$F$32,6,0)","v":25}]
[null,0]
[]
[]
{"$rows_left_out":41}
{"sheet":"CP registrations","index":2,"n_rows":50,"n_cols":30,"rows_kept":50,"cut":false,"hidden":false,"merged":[[11,1,12,6],[13,1,14,6],[15,1,17,6]]}
[{"$f":"'DATA CP REG'!A1","v":"Child Protection: Registrations: 31 July 2013-2019"}]
[null,null,"select comparators:"]
[null,{"$f":"J3","v":8},null,null,null,null,null,null,null,{"$f":"VLOOKUP('Select an authority'!$A$1,'REF CAs'!$A$1:$F$32,2,0)","v":8}]
[null,{"$f":"J4","v":31},null,null,null,null,null,null,null,{"$f":"VLOOKUP('Select an authority'!$A$1,'REF CAs'!$A$1:$F$32,3,0)","v":31}]
[null,{"$f":"J5","v":17},null,null,null,null,null,null,null,{"$f":"VLOOKUP('Select an authority'!$A$1,'REF CAs'!$A$1:$F$32,4,0)","v":17}]
[null,{"$f":"J6","v":1},null,null,null,null,null,null,null,{"$f":"VLOOKUP('Select an authority'!$A$1,'REF CAs'!$A$1:$F$32,5,0)","v":1}]
[null,{"$f":"J7","v":25},null,null,null,null,null,null,null,{"$f":"VLOOKUP('Select an authority'!$A$1,'REF CAs'!$A$1:$F$32,6,0)","v":25}]
[]
[]
[]
{"$rows_left_out":41}
{"sheet":"CP de-registrations","index":3,"n_rows":50,"n_cols":30,"rows_kept":50,"cut":false,"hidden":false,"merged":[[11,1,12,6],[13,1,14,6],[15,1,17,6]]}
[{"$f":"'DATA CP DEREG'!A1","v":"Child Protection: De-registrations: 31 July 2013-2019"}]
[]
[null,{"$f":"J3","v":8},null,null,null,{"$f":"VLOOKUP('Select an authority'!$A$1,'REF CAs'!$A$1:$F$32,2,0)","v":8},null,null,null,{"$f":"VLOOKUP('Select an authority'!$A$1,'REF CAs'!$A$1:$F$32,2,0)","v":8}]
[null,{"$f":"J4","v":31},null,null,null,{"$f":"VLOOKUP('Select an authority'!$A$1,'REF CAs'!$A$1:$F$32,3,0)","v":31},null,null,null,{"$f":"VLOOKUP('Select an authority'!$A$1,'REF CAs'!$A$1:$F$32,3,0)","v":31}]
[null,{"$f":"J5","v":17},null,null,null,{"$f":"VLOOKUP('Select an authority'!$A$1,'REF CAs'!$A$1:$F$32,4,0)","v":17},null,null,null,{"$f":"VLOOKUP('Select an authority'!$A$1,'REF CAs'!$A$1:$F$32,4,0)","v":17}]
[null,{"$f":"J6","v":1},null,null,null,{"$f":"VLOOKUP('Select an authority'!$A$1,'REF CAs'!$A$1:$F$32,5,0)","v":1},null,null,null,{"$f":"VLOOKUP('Select an authority'!$A$1,'REF CAs'!$A$1:$F$32,5,0)","v":1}]
[null,{"$f":"J7","v":25},null,null,null,{"$f":"VLOOKUP('Select an authority'!$A$1,'REF CAs'!$A$1:$F$32,6,0)","v":25},null,null,null,{"$f":"VLOOKUP('Select an authority'!$A$1,'REF CAs'!$A$1:$F$32,6,0)","v":25}]
[]
[]
[]
{"$rows_left_out":41}
{"sheet":"CP on register","index":4,"n_rows":51,"n_cols":30,"rows_kept":51,"cut":false,"hidden":false,"merged":[[11,1,13,6],[14,1,15,6],[16,1,18,6]]}
[{"$f":"'DATA CP ON REG'!A1","v":"Child Protection: On Child Protection Registers:  as at 31 July 2012-2018"}]
[null,null,"select comparators:"]
[null,{"$f":"J3","v":8},null,null,null,null,null,null,null,{"$f":"VLOOKUP('Select an authority'!$A$1,'REF CAs'!$A$1:$F$32,2,0)","v":8}]
[null,{"$f":"J4","v":31},null,null,null,null,null,null,null,{"$f":"VLOOKUP('Select an authority'!$A$1,'REF CAs'!$A$1:$F$32,3,0)","v":31}]
[null,{"$f":"J5","v":17},null,null,null,null,null,null,null,{"$f":"VLOOKUP('Select an authority'!$A$1,'REF CAs'!$A$1:$F$32,4,0)","v":17}]
[null,{"$f":"J6","v":1},null,null,null,null,null,null,null,{"$f":"VLOOKUP('Select an authority'!$A$1,'REF CAs'!$A$1:$F$32,5,0)","v":1}]
[null,{"$f":"J7","v":25},null,null,null,null,null,null,null,{"$f":"VLOOKUP('Select an authority'!$A$1,'REF CAs'!$A$1:$F$32,6,0)","v":25}]
[]
[]
[]
{"$rows_left_out":42}
{"sheet":"DATA CP CON","index":5,"n_rows":43,"n_cols":25,"rows_kept":43,"cut":false,"hidden":false,"merged":[[2,0,2,7],[2,17,2,24],[2,9,2,15],[3,9,3,15]]}
["Child Protection: Conferences: 31 July 2013-2019"]
[]
["Number of child protection referrals that resulted in a case conference: 31 July 2013-2019",null,null,null,null,null,null,null,null,"Population Aged 0-15",null,null,null,null,null,null,null,"Number of child protection referrals that resulted in a case conference per 1,000 children: year ended 31 July 2013-2019"]
[]
["Council",2013,2014,2015,2016,2017,2018,2019,null,2013,2014,2015,2016,2017,2018,2019,null,"Council",2013,2014,2015,2016,2017,2018,2019]
["Aberdeen City",212,225,205,196,205,176,208,null,33131,33511,33851,34187,34495,34833,35423,null,"Aberdeen City",{"$f":"IFERROR(B6*1000/J6,\"*\")","v":6.3988409646554585},{"$f":"IFERROR(C6*1000/K6,\"*\")","v":6.7142132434126109},6.0559510797317655,5.7331734284962117,5.9428902739527469,5.0526799299514824,5.8718911441718653]
["Aberdeenshire",80,97,126,117,134,127,154,null,48112,48669,48856,48871,48888,49033,49016,null,"Aberdeenshire",{"$f":"IFERROR(B7*1000/J7,\"*\")","v":1.6627868307283007},1.9930551274938872,2.5790076960864581,2.3940578257044054,2.7409589265259369,2.5900923867599372,3.141831238779174]
["Angus",160,216,193,181,171,202,143,null,19757,19676,19653,19445,19288,19253,19145,null,"Angus",8.0983955053904939,10.977841024598495,9.8203836564392208,9.3083054769863711,8.8656159270012438,10.491871396665454,7.4693131365891876]
["Argyll & Bute",76,63,67,73,92,80,68,null,13814,13575,13292,13238,13163,13024,12906,null,"Argyll & Bute",5.5016649775589981,4.6408839779005522,5.0406259404152873,5.5144281613536785,6.9892881561953963,6.1425061425061429,5.268867193553386]
["City of Edinburgh",498,522,476,482,368,312,201,null,74440,75329,76108,77364,78052,78501,79067,null,"City of Edinburgh",6.6899516389038149,6.9296021452561432,6.2542702475429657,6.2302879892456442,4.7148055142725367,3.9744716627813657,2.5421477987023664]
{"$rows_left_out":34}
{"sheet":"DATA CP REG","index":6,"n_rows":43,"n_cols":25,"rows_kept":43,"cut":false,"hidden":false,"merged":[[2,0,2,7],[2,17,2,24],[3,9,3,15],[2,9,2,15]]}
["Child Protection: Registrations: 31 July 2013-2019"]
[]
["Number of registrations following a case conference: 31 July 2013-2019",null,null,null,null,null,null,null,null,"Population Aged 0-15",null,null,null,null,null,null,null,"Number of registrations following a case conference per 1,000 children: 31 July 2013-2019"]
[]
["Council",2013,2014,2015,2016,2017,2018,2019,null,{"$f":"'DATA CP CON'!J5","v":2013},{"$f":"'DATA CP CON'!K5","v":2014},{"$f":"'DATA CP CON'!L5","v":2015},{"$f":"'DATA CP CON'!M5","v":2016},{"$f":"'DATA CP CON'!N5","v":2017},{"$f":"'DATA CP CON'!O5","v":2018},{"$f":"'DATA CP CON'!P5","v":2019},null,"Council",2013,2014,2015,2016,2017,2018,2019]
["Aberdeen City",170,167,159,156,164,150,162,null,{"$f":"'DATA CP CON'!J6","v":33131},{"$f":"'DATA CP CON'!K6","v":33511},{"$f":"'DATA CP CON'!L6","v":33851},{"$f":"'DATA CP CON'!M6","v":34187},{"$f":"'DATA CP CON'!N6","v":34495},{"$f":"'DATA CP CON'!O6","v":34833},{"$f":"'DATA CP CON'!P6","v":35423},null,"Aberdeen City",{"$f":"IFERROR(B6*1000/J6,\"*\")","v":5.1311460565633391},{"$f":"IFERROR(C6*1000/K6,\"*\")","v":4.9834382739995826},4.6970547398895155,4.5631380349255561,4.7543122191621974,4.3062613039359228,4.5732998334415491]
["Aberdeenshire",67,95,113,109,124,116,142,null,{"$f":"'DATA CP CON'!J7","v":48112},{"$f":"'DATA CP CON'!K7","v":48669},{"$f":"'DATA CP CON'!L7","v":48856},{"$f":"'DATA CP CON'!M7","v":48871},{"$f":"'DATA CP CON'!N7","v":48888},{"$f":"'DATA CP CON'!O7","v":49033},{"$f":"'DATA CP CON'!P7","v":49016},null,"Aberdeenshire",{"$f":"IFERROR(B7*1000/J7,\"*\")","v":1.3925839707349519},1.9519612073393742,2.3129196004584904,2.2303615641177794,2.5364097529045981,2.3657536760956908,2.8970132201730046]
["Angus",132,176,145,151,126,154,98,null,{"$f":"'DATA CP CON'!J8","v":19757},{"$f":"'DATA CP CON'!K8","v":19676},{"$f":"'DATA CP CON'!L8","v":19653},{"$f":"'DATA CP CON'!M8","v":19445},{"$f":"'DATA CP CON'!N8","v":19288},{"$f":"'DATA CP CON'!O8","v":19253},{"$f":"'DATA CP CON'!P8","v":19145},null,"Angus",6.6811762919471578,8.9449075015246997,7.378008446547601,7.7654924145024431,6.5325591041061797,7.9987534410221786,5.1188299817184646]
["Argyll & Bute",49,47,48,64,73,57,56,null,{"$f":"'DATA CP CON'!J9","v":13814},{"$f":"'DATA CP CON'!K9","v":13575},{"$f":"'DATA CP CON'!L9","v":13292},{"$f":"'DATA CP CON'!M9","v":13238},{"$f":"'DATA CP CON'!N9","v":13163},{"$f":"'DATA CP CON'!O9","v":13024},{"$f":"'DATA CP CON'!P9","v":12906},null,"Argyll & Bute",3.5471261039525119,3.4622467771639043,3.6111947035811016,4.8345671551593901,5.5458482108941727,4.3765356265356266,4.3390671005733763]
["City of Edinburgh",425,451,384,411,302,285,180,null,{"$f":"'DATA CP CON'!J10","v":74440},{"$f":"'DATA CP CON'!K10","v":75329},{"$f":"'DATA CP CON'!L10","v":76108},{"$f":"'DATA CP CON'!M10","v":77364},{"$f":"'DATA CP CON'!N10","v":78052},{"$f":"'DATA CP CON'!O10","v":78501},{"$f":"'DATA CP CON'!P10","v":79067},null,"City of Edinburgh",5.7092960773777541,5.9870700527021468,5.0454617123035685,5.3125484721575926,3.8692153948649617,3.6305269996560554,2.2765502674946565]
{"$rows_left_out":34}
{"sheet":"DATA CP DEREG","index":7,"n_rows":43,"n_cols":25,"rows_kept":43,"cut":false,"hidden":false,"merged":[[3,9,3,15],[2,9,2,15]]}
["Child Protection: De-registrations: 31 July 2013-2019"]
[]
["Number of de-registrations: 31 July 2013-2019",null,null,null,null,null,null,null,null,"Population Aged 0-15",null,null,null,null,null,null,null,"Number of de-registrations per 1,000 children: 31 July 2013-2019"]
[]
["Council",2013,2014,2015,2016,2017,2018,2019,null,{"$f":"'DATA CP CON'!J5","v":2013},{"$f":"'DATA CP CON'!K5","v":2014},{"$f":"'DATA CP CON'!L5","v":2015},{"$f":"'DATA CP CON'!M5","v":2016},{"$f":"'DATA CP CON'!N5","v":2017},{"$f":"'DATA CP CON'!O5","v":2018},{"$f":"'DATA CP CON'!P5","v":2019},null,"Council",{"$f":"B5","v":2013},{"$f":"C5","v":2014},2015,2016,2017,2018,2018]
["Aberdeen City",154,186,134,136,201,162,111,null,{"$f":"'DATA CP CON'!J6","v":33131},{"$f":"'DATA CP CON'!K6","v":33511},{"$f":"'DATA CP CON'!L6","v":33851},{"$f":"'DATA CP CON'!M6","v":34187},{"$f":"'DATA CP CON'!N6","v":34495},{"$f":"'DATA CP CON'!O6","v":34833},{"$f":"'DATA CP CON'!P6","v":35423},null,"Aberdeen City",{"$f":"IFERROR(B6*1000/J6,\"*\")","v":4.6482146630044365},{"$f":"IFERROR(C6*1000/K6,\"*\")","v":5.550416281221092},3.9585241204100323,3.9781203381402288,5.8269314393390346,4.6507622082507964,3.1335572932840243]
["Aberdeenshire",84,79,91,135,111,116,116,null,{"$f":"'DATA CP CON'!J7","v":48112},{"$f":"'DATA CP CON'!K7","v":48669},{"$f":"'DATA CP CON'!L7","v":48856},{"$f":"'DATA CP CON'!M7","v":48871},{"$f":"'DATA CP CON'!N7","v":48888},{"$f":"'DATA CP CON'!O7","v":49033},{"$f":"'DATA CP CON'!P7","v":49016},null,"Aberdeenshire",{"$f":"IFERROR(B7*1000/J7,\"*\")","v":1.7459261722647157},1.6232098461032691,1.8626166693957753,2.7623744142743138,2.2704958271968581,2.3657536760956908,2.3665741798596378]
["Angus",97,156,172,144,170,141,117,null,{"$f":"'DATA CP CON'!J8","v":19757},{"$f":"'DATA CP CON'!K8","v":19676},{"$f":"'DATA CP CON'!L8","v":19653},{"$f":"'DATA CP CON'!M8","v":19445},{"$f":"'DATA CP CON'!N8","v":19288},{"$f":"'DATA CP CON'!O8","v":19253},{"$f":"'DATA CP CON'!P8","v":19145},null,"Angus",4.909652275142987,7.9284407399878027,8.7518445021116378,7.4055026999228595,8.8137702198257983,7.3235339947021245,6.1112562026638813]
["Argyll & Bute",81,42,36,57,82,57,59,null,{"$f":"'DATA CP CON'!J9","v":13814},{"$f":"'DATA CP CON'!K9","v":13575},{"$f":"'DATA CP CON'!L9","v":13292},{"$f":"'DATA CP CON'!M9","v":13238},{"$f":"'DATA CP CON'!N9","v":13163},{"$f":"'DATA CP CON'!O9","v":13024},{"$f":"'DATA CP CON'!P9","v":12906},null,"Argyll & Bute",5.8636166208194584,3.0939226519337018,2.7083960276858261,4.3057863725638317,6.2295829218263314,4.3765356265356266,4.5715171238183787]
["City of Edinburgh",386,400,442,379,353,331,247,null,{"$f":"'DATA CP CON'!J10","v":74440},{"$f":"'DATA CP CON'!K10","v":75329},{"$f":"'DATA CP CON'!L10","v":76108},{"$f":"'DATA CP CON'!M10","v":77364},{"$f":"'DATA CP CON'!N10","v":78052},{"$f":"'DATA CP CON'!O10","v":78501},{"$f":"'DATA CP CON'!P10","v":79067},null,"City of Edinburgh",5.185384202041913,5.3100399580506847,5.8075366584327535,4.8989193940334008,4.5226259416799053,4.2165067960917693,3.1239328670621118]
{"$rows_left_out":34}
{"sheet":"DATA CP ON REG","index":8,"n_rows":43,"n_cols":25,"rows_kept":43,"cut":false,"hidden":false,"merged":[[2,0,2,7],[2,17,2,24],[3,9,3,15],[2,9,2,15],[0,0,0,7]]}
["Child Protection: On Child Protection Registers:  as at 31 July 2012-2018"]
[]
["Number of children on child protection registers: as at 31 July 2013-2019",null,null,null,null,null,null,null,null,"Population Aged 0-15",null,null,null,null,null,null,null,"Number of children on child protection registers per 1,000 children: as at 31 July 2013-2019"]
[]
["Council",2013,2014,2015,2016,2017,2018,2019,null,{"$f":"'DATA CP CON'!J5","v":2013},{"$f":"'DATA CP CON'!K5","v":2014},{"$f":"'DATA CP CON'!L5","v":2015},{"$f":"'DATA CP CON'!M5","v":2016},{"$f":"'DATA CP CON'!N5","v":2017},{"$f":"'DATA CP CON'!O5","v":2018},{"$f":"'DATA CP CON'!P5","v":2019},null,"Council",{"$f":"B5","v":2013},{"$f":"C5","v":2014},2015,2016,2017,2018,2018]
["Aberdeen City",92,73,98,118,80,68,119,null,{"$f":"'DATA CP CON'!J6","v":33131},{"$f":"'DATA CP CON'!K6","v":33511},{"$f":"'DATA CP CON'!L6","v":33851},{"$f":"'DATA CP CON'!M6","v":34187},{"$f":"'DATA CP CON'!N6","v":34495},{"$f":"'DATA CP CON'!O6","v":34833},{"$f":"'DATA CP CON'!P6","v":35423},null,"Aberdeen City",{"$f":"IFERROR(B6*1000/J6,\"*\")","v":2.7768555129636896},{"$f":"IFERROR(C6*1000/K6,\"*\")","v":2.178389185640536},2.8950400283595759,3.4516044110334336,2.3191766922742425,1.9521717911176184,3.359399260367558]
["Aberdeenshire",52,68,90,64,77,77,103,null,{"$f":"'DATA CP CON'!J7","v":48112},{"$f":"'DATA CP CON'!K7","v":48669},{"$f":"'DATA CP CON'!L7","v":48856},{"$f":"'DATA CP CON'!M7","v":48871},{"$f":"'DATA CP CON'!N7","v":48888},{"$f":"'DATA CP CON'!O7","v":49033},{"$f":"'DATA CP CON'!P7","v":49016},null,"Aberdeenshire",{"$f":"IFERROR(B7*1000/J7,\"*\")","v":1.0808114399733955},1.3971932852534468,1.8421483543474702,1.3095700926930081,1.5750286368843069,1.5703709746497256,2.1013546597029542]
["Angus",94,116,89,96,51,64,45,null,{"$f":"'DATA CP CON'!J8","v":19757},{"$f":"'DATA CP CON'!K8","v":19676},{"$f":"'DATA CP CON'!L8","v":19653},{"$f":"'DATA CP CON'!M8","v":19445},{"$f":"'DATA CP CON'!N8","v":19288},{"$f":"'DATA CP CON'!O8","v":19253},{"$f":"'DATA CP CON'!P8","v":19145},null,"Angus",4.7578073594169155,5.895507216914007,4.5285707016740444,4.9370017999485727,2.6441310659477395,3.3241572741910352,2.3504831548707235]
["Argyll & Bute",16,21,33,40,31,31,28,null,{"$f":"'DATA CP CON'!J9","v":13814},{"$f":"'DATA CP CON'!K9","v":13575},{"$f":"'DATA CP CON'!L9","v":13292},{"$f":"'DATA CP CON'!M9","v":13238},{"$f":"'DATA CP CON'!N9","v":13163},{"$f":"'DATA CP CON'!O9","v":13024},{"$f":"'DATA CP CON'!P9","v":12906},null,"Argyll & Bute",1.1582452584334733,1.5469613259668509,2.482696358712007,3.0216044719746185,2.3550862265441008,2.38022113022113,2.1695335502866882]
["City of Edinburgh",262,313,255,287,235,189,122,null,{"$f":"'DATA CP CON'!J10","v":74440},{"$f":"'DATA CP CON'!K10","v":75329},{"$f":"'DATA CP CON'!L10","v":76108},{"$f":"'DATA CP CON'!M10","v":77364},{"$f":"'DATA CP CON'!N10","v":78052},{"$f":"'DATA CP CON'!O10","v":78501},{"$f":"'DATA CP CON'!P10","v":79067},null,"City of Edinburgh",3.5196131112305213,4.1551062671746601,3.3505019183265885,3.709735794426348,3.0108133039512119,2.4076126418771735,1.5429951813019338]
{"$rows_left_out":34}
{"sheet":"REF EA Name","index":9,"n_rows":35,"n_cols":2,"rows_kept":35,"cut":false,"hidden":true,"merged":[]}
["EA Code","EA Name"]
[]
[100,"Aberdeen City"]
[110,"Aberdeenshire"]
[120,"Angus"]
[130,"Argyll & Bute"]
[230,"City of Edinburgh"]
[150,"Clackmannanshire"]
[170,"Dumfries & Galloway"]
[180,"Dundee City"]
{"$rows_left_out":26}
{"sheet":"REF CAS2","index":10,"n_rows":33,"n_cols":12,"rows_kept":33,"cut":false,"hidden":true,"merged":[]}
[]
[100,"Aberdeen City","City of Edinburgh","****","Dundee City","***","South Ayrshire","***","Argyll and Bute","***","Renfrewshire","***"]
[110,"Aberdeenshire","Stirling","****","Perth and Kinross","****","Highland","****","Scottish Borders","****","South Lanarkshire","****"]
[120,"Angus","Highland","*****","Dumfries and Galloway","*****","Moray","*****","Scottish Borders","****","South Ayrshire","****"]
[130,"Argyll & Bute","South Ayrshire","*****","Dumfries and Galloway","****","Scottish Borders","****","Highland","****","Angus","****"]
[230,"City of Edinburgh","Aberdeen City","****","Dundee City","**","South Ayrshire","**","Argyll and Bute","**","Renfrewshire","**"]
[150,"Clackmannanshire","North Lanarkshire","*****","West Lothian","****","Falkirk","****","South Lanarkshire","****","East Ayrshire","****"]
[170,"Dumfries & Galloway","Angus","*****","Highland","****","Argyll and Bute","****","Scottish Borders","****","Moray","****"]
[180,"Dundee City","Aberdeen City","***","Renfrewshire","***","Dumfries and Galloway","***","Inverclyde","***","South Ayrshire","***"]
[190,"East Ayrshire","North Lanarkshire","*****","Clackmannanshire","****","Falkirk","****","North Ayrshire","****","West Lothian","****"]
{"$rows_left_out":24}
{"sheet":"REF CAs","index":11,"n_rows":70,"n_cols":11,"rows_kept":70,"cut":false,"hidden":true,"merged":[]}
[1,{"$f":"INDEX($J$1:$K$32,MATCH(C39,$J$1:$J$32,0),2)","v":5},{"$f":"INDEX($J$1:$K$32,MATCH(D39,$J$1:$J$32,0),2)","v":8},28,4,25,null,null,"Aberdeen City","Aberdeen City",1]
[2,{"$f":"INDEX($J$1:$K$32,MATCH(C40,$J$1:$J$32,0),2)","v":30},24,16,26,29,null,null,"Aberdeenshire","Aberdeenshire",2]
[3,16,7,19,26,28,null,null,"Angus","Angus",3]
[4,28,7,26,16,3,null,null,"Argyll and Bute","Argyll and Bute",4]
[5,1,8,28,4,25,null,null,"Clackmannanshire","City of Edinburgh",5]
[6,22,32,13,29,9,null,null,"Dumfries and Galloway","Clackmannanshire",6]
[7,3,16,4,26,19,null,null,"Dundee City","Dumfries and Galloway",7]
[8,1,25,7,17,28,null,null,"East Ayrshire","Dundee City",8]
[9,22,6,13,21,32,null,null,"East Dunbartonshire","East Ayrshire",9]
[10,12,30,11,2,24,null,null,"East Lothian","East Dunbartonshire",10]
{"$rows_left_out":60}