{"text_format":"1","workbook":"xlsx","n_sheets":2,"sheets":["2017","List"],"not_rendered":{"charts":0,"images":0,"macros":1,"external_links":1,"defined_names":4,"comments":1,"pivot_tables":0},"unopened":[],"bounds":{"document_bytes":16777216,"sheet_cells":100000,"rows_first":2000,"rows_last":500,"rows_between":2000,"halvings":0,"cell_chars":16384,"cell_head_chars":4096},"cells_cut":0,"cells_raw":0,"read":"whole","date_system":"1900"}

{"sheet":"2017","index":0,"n_rows":79,"n_cols":15,"rows_kept":79,"cut":false,"hidden":false,"merged":[]}
[null,null,null,"Week 36","Week 37","Week 37","Week 38","Week 38","Week 39","Week 40","Week 41","Week 42","Week 43","Week 44","Week 45"]
[null,null,null,1,1,null,1,null,1,1,1,1,1,1,1]
["Site No","Site Name","Business Name","Count","Count","FHI Action","Count","FHI Action","Count","Count","Count","Count","Count","Count","Count"]
["FS0050",{"$f":"IF(ISBLANK(A4),\"\",VLOOKUP(A4,List!A:E,2,FALSE))","v":"Kenmore Loch Torridon"},{"$f":"IF(ISBLANK(A4),\"\",VLOOKUP(A4,List!A:E,3,FALSE))","v":"The Scottish Salmon Company"}]
["FS0051",{"$f":"IF(ISBLANK(A5),\"\",VLOOKUP(A5,List!A:E,2,FALSE))","v":"Bagh Chlann Neill"},{"$f":"IF(ISBLANK(A5),\"\",VLOOKUP(A5,List!A:E,3,FALSE))","v":"The Scottish Salmon Company"}]
["FS0091",{"$f":"IF(ISBLANK(A6),\"\",VLOOKUP(A6,List!A:E,2,FALSE))","v":"Meall Mhor Loch Fyne"},{"$f":"IF(ISBLANK(A6),\"\",VLOOKUP(A6,List!A:E,3,FALSE))","v":"The Scottish Salmon Company"}]
["FS0242",{"$f":"IF(ISBLANK(A7),\"\",VLOOKUP(A7,List!A:E,2,FALSE))","v":"Loch Odhairn"},{"$f":"IF(ISBLANK(A7),\"\",VLOOKUP(A7,List!A:E,3,FALSE))","v":"The Scottish Salmon Company"},9.5399999999999991,"no count",null,1.2,null,2.46,4.5,6.93,2.6,3.62,"<3","<3"]
["FS0340",{"$f":"IF(ISBLANK(A8),\"\",VLOOKUP(A8,List!A:E,2,FALSE))","v":"Kilerivagh / Petersport"},{"$f":"IF(ISBLANK(A8),\"\",VLOOKUP(A8,List!A:E,3,FALSE))","v":"The Scottish Salmon Company"}]
["FS0570",{"$f":"IF(ISBLANK(A9),\"\",VLOOKUP(A9,List!A:E,2,FALSE))","v":"Strome"},{"$f":"IF(ISBLANK(A9),\"\",VLOOKUP(A9,List!A:E,3,FALSE))","v":"The Scottish Salmon Company"},1.63,3.65,null,6.84,null,0.9,1.27,6.87,7.88,9.6199999999999992,"<3",">8"]
["FS0594",{"$f":"IF(ISBLANK(A10),\"\",VLOOKUP(A10,List!A:E,2,FALSE))","v":"Aird"},{"$f":"IF(ISBLANK(A10),\"\",VLOOKUP(A10,List!A:E,3,FALSE))","v":"The Scottish Salmon Company"},5.98,5.6,null,null,null,"<3","No Count","Eoc"]
["FS0683",{"$f":"IF(ISBLANK(A11),\"\",VLOOKUP(A11,List!A:E,2,FALSE))","v":"Gob a Bharra Loch Fyne"},{"$f":"IF(ISBLANK(A11),\"\",VLOOKUP(A11,List!A:E,3,FALSE))","v":"The Scottish Salmon Company"}]
["FS0698",{"$f":"IF(ISBLANK(A12),\"\",VLOOKUP(A12,List!A:E,2,FALSE))","v":"Quarry Point"},{"$f":"IF(ISBLANK(A12),\"\",VLOOKUP(A12,List!A:E,3,FALSE))","v":"The Scottish Salmon Company"}]
["FS0818",{"$f":"IF(ISBLANK(A13),\"\",VLOOKUP(A13,List!A:E,2,FALSE))","v":"Ardcastle Bay"},{"$f":"IF(ISBLANK(A13),\"\",VLOOKUP(A13,List!A:E,3,FALSE))","v":"The Scottish Salmon Company"}]
["FS0839",{"$f":"IF(ISBLANK(A14),\"\",VLOOKUP(A14,List!A:E,2,FALSE))","v":"Geasgill"},{"$f":"IF(ISBLANK(A14),\"\",VLOOKUP(A14,List!A:E,3,FALSE))","v":"The Scottish Salmon Company"},4.57,0.82,null,2.52]
["FS1010",{"$f":"IF(ISBLANK(A15),\"\",VLOOKUP(A15,List!A:E,2,FALSE))","v":"East Tarbert Bay"},{"$f":"IF(ISBLANK(A15),\"\",VLOOKUP(A15,List!A:E,3,FALSE))","v":"The Scottish Salmon Company"},4.08,2.82,null,5.98,null,"<3"]
["FS1019",{"$f":"IF(ISBLANK(A16),\"\",VLOOKUP(A16,List!A:E,2,FALSE))","v":"Strondoir Bay"},{"$f":"IF(ISBLANK(A16),\"\",VLOOKUP(A16,List!A:E,3,FALSE))","v":"The Scottish Salmon Company"}]
["FS1255","North Uiskevagh","The Scottish Salmon Company",null,null,null,"<3",null,"≥3<8 ","<3","<3",null,">3<8",">3<8",">3<8"]
["FS1256",{"$f":"IF(ISBLANK(A18),\"\",VLOOKUP(A18,List!A:E,2,FALSE))","v":"Plocrapol"},{"$f":"IF(ISBLANK(A18),\"\",VLOOKUP(A18,List!A:E,3,FALSE))","v":"The Scottish Salmon Company"}]
["FS1262",{"$f":"IF(ISBLANK(A19),\"\",VLOOKUP(A19,List!A:E,2,FALSE))","v":"Sgeir Dughall"},{"$f":"IF(ISBLANK(A19),\"\",VLOOKUP(A19,List!A:E,3,FALSE))","v":"The Scottish Salmon Company"}]
["FS1277",{"$f":"IF(ISBLANK(A20),\"\",VLOOKUP(A20,List!A:E,2,FALSE))","v":"Reibinish"},{"$f":"IF(ISBLANK(A20),\"\",VLOOKUP(A20,List!A:E,3,FALSE))","v":"The Scottish Salmon Company"}]
["FS1282",{"$f":"IF(ISBLANK(A21),\"\",VLOOKUP(A21,List!A:E,2,FALSE))","v":"Greanamul"},{"$f":"IF(ISBLANK(A21),\"\",VLOOKUP(A21,List!A:E,3,FALSE))","v":"The Scottish Salmon Company"},3.74,3.62,null,3.48,null,"≥3<8 ","no count",3.3,"no count",3.85,3.9,"no count"]
["FS1293",{"$f":"IF(ISBLANK(A22),\"\",VLOOKUP(A22,List!A:E,2,FALSE))","v":"Scadabay"},{"$f":"IF(ISBLANK(A22),\"\",VLOOKUP(A22,List!A:E,3,FALSE))","v":"The Scottish Salmon Company"}]
["FS1304",{"$f":"IF(ISBLANK(A23),\"\",VLOOKUP(A23,List!A:E,2,FALSE))","v":"Maragay Mor"},{"$f":"IF(ISBLANK(A23),\"\",VLOOKUP(A23,List!A:E,3,FALSE))","v":"The Scottish Salmon Company"}]
["FS0033",{"$f":"IF(ISBLANK(A24),\"\",VLOOKUP(A24,List!A:E,2,FALSE))","v":"Dury Voe"},{"$f":"IF(ISBLANK(A24),\"\",VLOOKUP(A24,List!A:E,3,FALSE))","v":"Scottish Sea Farms Ltd"},null,null,null,null,null,null,null,null,null,null,null,"EoC"]
["FS0183",{"$f":"IF(ISBLANK(A25),\"\",VLOOKUP(A25,List!A:E,2,FALSE))","v":"South Sound"},{"$f":"IF(ISBLANK(A25),\"\",VLOOKUP(A25,List!A:E,3,FALSE))","v":"Scottish Sea Farms Ltd"}]
["FS0359",{"$f":"IF(ISBLANK(A26),\"\",VLOOKUP(A26,List!A:E,2,FALSE))","v":"Kempie Bay"},{"$f":"IF(ISBLANK(A26),\"\",VLOOKUP(A26,List!A:E,3,FALSE))","v":"Scottish Sea Farms Ltd"}]
["FS0361",{"$f":"IF(ISBLANK(A27),\"\",VLOOKUP(A27,List!A:E,2,FALSE))","v":"Sian Bay"},{"$f":"IF(ISBLANK(A27),\"\",VLOOKUP(A27,List!A:E,3,FALSE))","v":"Scottish Sea Farms Ltd"}]
["FS0400",{"$f":"IF(ISBLANK(A28),\"\",VLOOKUP(A28,List!A:E,2,FALSE))","v":"Snaraness"},{"$f":"IF(ISBLANK(A28),\"\",VLOOKUP(A28,List!A:E,3,FALSE))","v":"Scottish Sea Farms Ltd"}]
["FS0616",{"$f":"IF(ISBLANK(A29),\"\",VLOOKUP(A29,List!A:E,2,FALSE))","v":"Nevis B"},{"$f":"IF(ISBLANK(A29),\"\",VLOOKUP(A29,List!A:E,3,FALSE))","v":"Scottish Sea Farms Ltd"}]
["FS0699",{"$f":"IF(ISBLANK(A30),\"\",VLOOKUP(A30,List!A:E,2,FALSE))","v":"Loura Voe"},{"$f":"IF(ISBLANK(A30),\"\",VLOOKUP(A30,List!A:E,3,FALSE))","v":"Scottish Sea Farms Ltd"}]
["FS0709",{"$f":"IF(ISBLANK(A31),\"\",VLOOKUP(A31,List!A:E,2,FALSE))","v":"Kishorn A (South)"},{"$f":"IF(ISBLANK(A31),\"\",VLOOKUP(A31,List!A:E,3,FALSE))","v":"Scottish Sea Farms Ltd"},null,null,null,null,null,5.67,"no count","no count","no count","no count","EoC"]
["FS0749",{"$f":"IF(ISBLANK(A32),\"\",VLOOKUP(A32,List!A:E,2,FALSE))","v":"Holms Geo"},{"$f":"IF(ISBLANK(A32),\"\",VLOOKUP(A32,List!A:E,3,FALSE))","v":"Scottish Sea Farms Ltd"}]
["FS0804",{"$f":"IF(ISBLANK(A33),\"\",VLOOKUP(A33,List!A:E,2,FALSE))","v":"Kishorn B (North)"},{"$f":"IF(ISBLANK(A33),\"\",VLOOKUP(A33,List!A:E,3,FALSE))","v":"Scottish Sea Farms Ltd"},null,null,null,null,null,null,null,null,6,"no count",4.2,3.9]
["FS0936",{"$f":"IF(ISBLANK(A34),\"\",VLOOKUP(A34,List!A:E,2,FALSE))","v":"Foreholm"},{"$f":"IF(ISBLANK(A34),\"\",VLOOKUP(A34,List!A:E,3,FALSE))","v":"Scottish Sea Farms Ltd"}]
["FS1093",{"$f":"IF(ISBLANK(A35),\"\",VLOOKUP(A35,List!A:E,2,FALSE))","v":"Teisti Geo"},{"$f":"IF(ISBLANK(A35),\"\",VLOOKUP(A35,List!A:E,3,FALSE))","v":"Scottish Sea Farms Ltd"},null,null,null,null,null,null,"EoC"]
["FS1274",{"$f":"IF(ISBLANK(A36),\"\",VLOOKUP(A36,List!A:E,2,FALSE))","v":"Kishorn West"},{"$f":"IF(ISBLANK(A36),\"\",VLOOKUP(A36,List!A:E,3,FALSE))","v":"Scottish Sea Farms Ltd"},null,null,null,null,null,null,null,null,5.9,"no count",3.8,4.0999999999999996]
["FS0016",{"$f":"IF(ISBLANK(A37),\"\",VLOOKUP(A37,List!A:E,2,FALSE))","v":"Loch Alsh (Sron)"},{"$f":"IF(ISBLANK(A37),\"\",VLOOKUP(A37,List!A:E,3,FALSE))","v":"Marine Harvest (Scotland) Ltd"},null,null,null,null,null,null,null,null,4.4800000000000004]
["FS0212",{"$f":"IF(ISBLANK(A38),\"\",VLOOKUP(A38,List!A:E,2,FALSE))","v":"Invasion Bay"},{"$f":"IF(ISBLANK(A38),\"\",VLOOKUP(A38,List!A:E,3,FALSE))","v":"Marine Harvest (Scotland) Ltd"},null,null,null,null,null,null,3.33,3.12,3.93]
["FS0240",{"$f":"IF(ISBLANK(A39),\"\",VLOOKUP(A39,List!A:E,2,FALSE))","v":"Linnhe"},{"$f":"IF(ISBLANK(A39),\"\",VLOOKUP(A39,List!A:E,3,FALSE))","v":"Marine Harvest (Scotland) Ltd"}]
["FS0241",{"$f":"IF(ISBLANK(A40),\"\",VLOOKUP(A40,List!A:E,2,FALSE))","v":"Kingairloch"},{"$f":"IF(ISBLANK(A40),\"\",VLOOKUP(A40,List!A:E,3,FALSE))","v":"Marine Harvest (Scotland) Ltd"}]
["FS0252",{"$f":"IF(ISBLANK(A41),\"\",VLOOKUP(A41,List!A:E,2,FALSE))","v":"Cairidh"},{"$f":"IF(ISBLANK(A41),\"\",VLOOKUP(A41,List!A:E,3,FALSE))","v":"Marine Harvest (Scotland) Ltd"},"EoC"]
["FS0519",{"$f":"IF(ISBLANK(A42),\"\",VLOOKUP(A42,List!A:E,2,FALSE))","v":"Maol Ban"},{"$f":"IF(ISBLANK(A42),\"\",VLOOKUP(A42,List!A:E,3,FALSE))","v":"Marine Harvest (Scotland) Ltd"}]
["FS0531",{"$f":"IF(ISBLANK(A43),\"\",VLOOKUP(A43,List!A:E,2,FALSE))","v":"Ornish Island"},{"$f":"IF(ISBLANK(A43),\"\",VLOOKUP(A43,List!A:E,3,FALSE))","v":"Marine Harvest (Scotland) Ltd"}]
["FS0629",{"$f":"IF(ISBLANK(A44),\"\",VLOOKUP(A44,List!A:E,2,FALSE))","v":"Poll Na Gille"},{"$f":"IF(ISBLANK(A44),\"\",VLOOKUP(A44,List!A:E,3,FALSE))","v":"Marine Harvest (Scotland) Ltd"},null,null,null,null,null,null,null,null,3.59]
["FS0646",{"$f":"IF(ISBLANK(A45),\"\",VLOOKUP(A45,List!A:E,2,FALSE))","v":"Soay"},{"$f":"IF(ISBLANK(A45),\"\",VLOOKUP(A45,List!A:E,3,FALSE))","v":"Marine Harvest (Scotland) Ltd"}]
["FS0805",{"$f":"IF(ISBLANK(A46),\"\",VLOOKUP(A46,List!A:E,2,FALSE))","v":"Bagh Dail Nan Cean"},{"$f":"IF(ISBLANK(A46),\"\",VLOOKUP(A46,List!A:E,3,FALSE))","v":"Marine Harvest (Scotland) Ltd"},null,null,null,null,null,4.53,7.01,4.9400000000000004,7.52]
["FS0859",{"$f":"IF(ISBLANK(A47),\"\",VLOOKUP(A47,List!A:E,2,FALSE))","v":"Port Na Cro"},{"$f":"IF(ISBLANK(A47),\"\",VLOOKUP(A47,List!A:E,3,FALSE))","v":"Marine Harvest (Scotland) Ltd"},null,null,null,null,null,3.02,null,null,7.5]
["FS1033",{"$f":"IF(ISBLANK(A48),\"\",VLOOKUP(A48,List!A:E,2,FALSE))","v":"North Shore"},{"$f":"IF(ISBLANK(A48),\"\",VLOOKUP(A48,List!A:E,3,FALSE))","v":"Marine Harvest (Scotland) Ltd"},"<3",null,null,null,null,null,4.67,"<3",3.56]
["FS1083",{"$f":"IF(ISBLANK(A49),\"\",VLOOKUP(A49,List!A:E,2,FALSE))","v":"Groatay"},{"$f":"IF(ISBLANK(A49),\"\",VLOOKUP(A49,List!A:E,3,FALSE))","v":"Marine Harvest (Scotland) Ltd"}]
["FS1176",{"$f":"IF(ISBLANK(A50),\"\",VLOOKUP(A50,List!A:E,2,FALSE))","v":"Eilean Grianain"},{"$f":"IF(ISBLANK(A50),\"\",VLOOKUP(A50,List!A:E,3,FALSE))","v":"Marine Harvest (Scotland) Ltd"}]
["FS1259",{"$f":"IF(ISBLANK(A51),\"\",VLOOKUP(A51,List!A:E,2,FALSE))","v":"Stulaigh"},{"$f":"IF(ISBLANK(A51),\"\",VLOOKUP(A51,List!A:E,3,FALSE))","v":"Marine Harvest (Scotland) Ltd"}]
["FS1261",{"$f":"IF(ISBLANK(A52),\"\",VLOOKUP(A52,List!A:E,2,FALSE))","v":"Hellisay"},{"$f":"IF(ISBLANK(A52),\"\",VLOOKUP(A52,List!A:E,3,FALSE))","v":"Marine Harvest (Scotland) Ltd"},3.36,null,null,"<3"]
["FS1291",{"$f":"IF(ISBLANK(A53),\"\",VLOOKUP(A53,List!A:E,2,FALSE))","v":"Caolas A Deas"},{"$f":"IF(ISBLANK(A53),\"\",VLOOKUP(A53,List!A:E,3,FALSE))","v":"Marine Harvest (Scotland) Ltd"},null,null,null,null,null,null,null,3.54,5.53,3.61,1.3]
["FS1297",{"$f":"IF(ISBLANK(A54),\"\",VLOOKUP(A54,List!A:E,2,FALSE))","v":"Tabhaigh"},{"$f":"IF(ISBLANK(A54),\"\",VLOOKUP(A54,List!A:E,3,FALSE))","v":"Marine Harvest (Scotland) Ltd"},null,null,null,null,null,null,null,4.16,7.5]
["FS0065",{"$f":"IF(ISBLANK(A55),\"\",VLOOKUP(A55,List!A:E,2,FALSE))","v":"Loch Laxford"},{"$f":"IF(ISBLANK(A55),\"\",VLOOKUP(A55,List!A:E,3,FALSE))","v":"Loch Duart Ltd"}]
["FS0067",{"$f":"IF(ISBLANK(A56),\"\",VLOOKUP(A56,List!A:E,2,FALSE))","v":"Badcall Bay"},{"$f":"IF(ISBLANK(A56),\"\",VLOOKUP(A56,List!A:E,3,FALSE))","v":"Loch Duart Ltd"}]
["FS0933",{"$f":"IF(ISBLANK(A57),\"\",VLOOKUP(A57,List!A:E,2,FALSE))","v":"Clashnessie Bay"},{"$f":"IF(ISBLANK(A57),\"\",VLOOKUP(A57,List!A:E,3,FALSE))","v":"Loch Duart Ltd"}]
["FS1280",{"$f":"IF(ISBLANK(A58),\"\",VLOOKUP(A58,List!A:E,2,FALSE))","v":"Loch Carnan"},{"$f":"IF(ISBLANK(A58),\"\",VLOOKUP(A58,List!A:E,3,FALSE))","v":"Loch Duart Ltd"}]
["FS0465",{"$f":"IF(ISBLANK(A59),\"\",VLOOKUP(A59,List!A:E,2,FALSE))","v":"Shuna Castle"},{"$f":"IF(ISBLANK(A59),\"\",VLOOKUP(A59,List!A:E,3,FALSE))","v":"Kames Fish Farming Ltd"},null,null,null,null,null,null,null,null,null,null,null,4.5]
["FS1290",{"$f":"IF(ISBLANK(A60),\"\",VLOOKUP(A60,List!A:E,2,FALSE))","v":"Shuna SW (Rubh'an Trilleachain)"},{"$f":"IF(ISBLANK(A60),\"\",VLOOKUP(A60,List!A:E,3,FALSE))","v":"Kames Fish Farming Ltd"},null,null,null,6.18,null,"<3",null,null,4.28]
["FS0433",{"$f":"IF(ISBLANK(A61),\"\",VLOOKUP(A61,List!A:E,2,FALSE))","v":"Langa Isle (East)"},{"$f":"IF(ISBLANK(A61),\"\",VLOOKUP(A61,List!A:E,3,FALSE))","v":"Grieg Seafood Shetland Ltd"}]
["FS0489",{"$f":"IF(ISBLANK(A62),\"\",VLOOKUP(A62,List!A:E,2,FALSE))","v":"Cole Deep"},{"$f":"IF(ISBLANK(A62),\"\",VLOOKUP(A62,List!A:E,3,FALSE))","v":"Grieg Seafood Shetland Ltd"},null,null,null,4.55,null,3.35,3.63,3.82,"no count",9.8000000000000007,8.35,7.9]
["FS0515",{"$f":"IF(ISBLANK(A63),\"\",VLOOKUP(A63,List!A:E,2,FALSE))","v":"North Papa"},{"$f":"IF(ISBLANK(A63),\"\",VLOOKUP(A63,List!A:E,3,FALSE))","v":"Grieg Seafood Shetland Ltd"}]
["FS0674",{"$f":"IF(ISBLANK(A64),\"\",VLOOKUP(A64,List!A:E,2,FALSE))","v":"North Havra"},{"$f":"IF(ISBLANK(A64),\"\",VLOOKUP(A64,List!A:E,3,FALSE))","v":"Grieg Seafood Shetland Ltd"}]
["FS0785",{"$f":"IF(ISBLANK(A65),\"\",VLOOKUP(A65,List!A:E,2,FALSE))","v":"Spoose Holm"},{"$f":"IF(ISBLANK(A65),\"\",VLOOKUP(A65,List!A:E,3,FALSE))","v":"Grieg Seafood Shetland Ltd"},null,"EoC","EoC"]
["FS0800",{"$f":"IF(ISBLANK(A66),\"\",VLOOKUP(A66,List!A:E,2,FALSE))","v":"Leinish"},{"$f":"IF(ISBLANK(A66),\"\",VLOOKUP(A66,List!A:E,3,FALSE))","v":"Grieg Seafood Shetland Ltd"}]
["FS0937",{"$f":"IF(ISBLANK(A67),\"\",VLOOKUP(A67,List!A:E,2,FALSE))","v":"West of Burwick"},{"$f":"IF(ISBLANK(A67),\"\",VLOOKUP(A67,List!A:E,3,FALSE))","v":"Grieg Seafood Shetland Ltd"}]
["FS0948",{"$f":"IF(ISBLANK(A68),\"\",VLOOKUP(A68,List!A:E,2,FALSE))","v":"Score Holms"},{"$f":"IF(ISBLANK(A68),\"\",VLOOKUP(A68,List!A:E,3,FALSE))","v":"Grieg Seafood Shetland Ltd"},null,null,null,null,null,"EoC"]
["FS1175",{"$f":"IF(ISBLANK(A69),\"\",VLOOKUP(A69,List!A:E,2,FALSE))","v":"Gob na Hoe"},{"$f":"IF(ISBLANK(A69),\"\",VLOOKUP(A69,List!A:E,3,FALSE))","v":"Grieg Seafood Shetland Ltd"}]
["FS1278",{"$f":"IF(ISBLANK(A70),\"\",VLOOKUP(A70,List!A:E,2,FALSE))","v":"East of Papa Little"},{"$f":"IF(ISBLANK(A70),\"\",VLOOKUP(A70,List!A:E,3,FALSE))","v":"Grieg Seafood Shetland Ltd"},null,3.29,null,7.03,null,4.95,7.98,9.01,"no count",11.91,11.2,13.2]
["FS1287",{"$f":"IF(ISBLANK(A71),\"\",VLOOKUP(A71,List!A:E,2,FALSE))","v":"Corlarach"},{"$f":"IF(ISBLANK(A71),\"\",VLOOKUP(A71,List!A:E,3,FALSE))","v":"Grieg Seafood Shetland Ltd"}]
["FS1112",{"$f":"IF(ISBLANK(A72),\"\",VLOOKUP(A72,List!A:E,2,FALSE))","v":"Etive 4"},{"$f":"IF(ISBLANK(A72),\"\",VLOOKUP(A72,List!A:E,3,FALSE))","v":"Dawnfresh Farming Ltd"}]
["FS0088",{"$f":"IF(ISBLANK(A73),\"\",VLOOKUP(A73,List!A:E,2,FALSE))","v":"Cloudin"},{"$f":"IF(ISBLANK(A73),\"\",VLOOKUP(A73,List!A:E,3,FALSE))","v":"Cooke Aquaculture Scotland Ltd"}]
["FS0382",{"$f":"IF(ISBLANK(A74),\"\",VLOOKUP(A74,List!A:E,2,FALSE))","v":"Uyea Isle"},{"$f":"IF(ISBLANK(A74),\"\",VLOOKUP(A74,List!A:E,3,FALSE))","v":"Cooke Aquaculture Scotland Ltd"}]
["FS0451",{"$f":"IF(ISBLANK(A75),\"\",VLOOKUP(A75,List!A:E,2,FALSE))","v":"Turness"},{"$f":"IF(ISBLANK(A75),\"\",VLOOKUP(A75,List!A:E,3,FALSE))","v":"Cooke Aquaculture Scotland Ltd"}]
["FS0472",{"$f":"IF(ISBLANK(A76),\"\",VLOOKUP(A76,List!A:E,2,FALSE))","v":"Wick of Belmont"},{"$f":"IF(ISBLANK(A76),\"\",VLOOKUP(A76,List!A:E,3,FALSE))","v":"Cooke Aquaculture Scotland Ltd"}]
["FS0656",{"$f":"IF(ISBLANK(A77),\"\",VLOOKUP(A77,List!A:E,2,FALSE))","v":"Djubawick"},{"$f":"IF(ISBLANK(A77),\"\",VLOOKUP(A77,List!A:E,3,FALSE))","v":"Cooke Aquaculture Scotland Ltd"}]
["FS1057",{"$f":"IF(ISBLANK(A78),\"\",VLOOKUP(A78,List!A:E,2,FALSE))","v":"Vee Taing"},{"$f":"IF(ISBLANK(A78),\"\",VLOOKUP(A78,List!A:E,3,FALSE))","v":"Cooke Aquaculture Scotland Ltd"}]
["FS1279",{"$f":"IF(ISBLANK(A79),\"\",VLOOKUP(A79,List!A:E,2,FALSE))","v":"Bastaness"},{"$f":"IF(ISBLANK(A79),\"\",VLOOKUP(A79,List!A:E,3,FALSE))","v":"Cooke Aquaculture Scotland Ltd"}]

{"sheet":"List","index":1,"n_rows":256,"n_cols":7,"rows_kept":256,"cut":false,"hidden":true,"merged":[]}
["FS0001","Evanachan Salt Water","Otter Ferry Seafish  Ltd.,","FB0012","M-42","BIO REDUCTION","EoC"]
["FS0015","Loch Greshornish","Marine Harvest (Scotland) Ltd","FB0119","M-24","BATH","BREACH"]
["FS0016","Loch Alsh (Sron)","Marine Harvest (Scotland) Ltd","FB0119","M-21","CLEANERFISH","EN"]
["FS0031","Pegal Bay","Cooke Aquaculture Scotland Ltd","FB0095","O-3","HARVESTING","Warning Letter"]
["FS0033","Dury Voe","Scottish Sea Farms Ltd","FB0125","S-5","IN FEED"]
["FS0039","Pobie Sukka","Scottish Sea Farms Ltd","FB0125","S-7","MECHANICAL"]
["FS0050","Kenmore Loch Torridon","The Scottish Salmon Company","FB0169","M-17","EoC"]
["FS0051","Bagh Chlann Neill","The Scottish Salmon Company","FB0169","W-14"]
["FS0054","Lyrawa Bay","Cooke Aquaculture Scotland Ltd","FB0095","O-3"]
["FS0056","Ardmair","Wester Ross Fisheries Ltd","FB0447","M-11"]
["FS0057","Corry Farm","Wester Ross Fisheries Ltd","FB0447","M-12"]
["FS0065","Loch Laxford","Loch Duart Ltd","FB0398","M-3"]
["FS0067","Badcall Bay","Loch Duart Ltd","FB0398","M-4"]
["FS0068","Calva Bay (Calbha Beag)","Loch Duart Ltd","FB0398","M-5"]
["FS0088","Cloudin","Cooke Aquaculture Scotland Ltd","FB0095","S-10"]
["FS0090","Ormsary Broodstock Unit","Landcatch Natural Selection Ltd","FB0061","M-44"]
["FS0091","Meall Mhor Loch Fyne","The Scottish Salmon Company","FB0169","M-42"]
["FS0122","Bay of Ham","Cooke Aquaculture Scotland Ltd","FB0095","O-2"]
["FS0129","Nedd","Loch Duart Ltd","FB0398","M-7"]
["FS0166","Holm of Gruting","Cooke Aquaculture Scotland Ltd","FB0095","S-10"]
["FS0167","Mid Taing","Cooke Aquaculture Scotland Ltd","FB0095","S-10"]
["FS0183","South Sound","Scottish Sea Farms Ltd","FB0125","S-8a"]
["FS0190","Loch Stockinish","The Scottish Salmon Company","FB0169","W-9"]
["FS0197","Ardchattan Bay","Dawnfresh Farming Ltd","FB0456","M-36"]
["FS0209","Scallastle","Scottish Sea Farms Ltd","FB0125","M-35"]
["FS0212","Invasion Bay","Marine Harvest (Scotland) Ltd","FB0119","M-34"]
["FS0213","Crooie","Scottish Sea Farms Ltd","FB0125","S-11"]
["FS0228","Selivoe (High Banks)","Scottish Sea Farms Ltd","FB0125","S-11"]
["FS0230","Brunaness","Scottish Sea Farms Ltd","FB0125","S-11"]
["FS0234","Torridon","Marine Harvest (Scotland) Ltd","FB0119","M-17"]
["FS0237","Gorsten","Marine Harvest (Scotland) Ltd","FB0119","M-33"]
["FS0240","Linnhe","Marine Harvest (Scotland) Ltd","FB0119","M-33"]
["FS0241","Kingairloch","Marine Harvest (Scotland) Ltd","FB0119","M-36"]
["FS0242","Loch Odhairn","The Scottish Salmon Company","FB0169","W-4"]
["FS0244","Loch Leven (1)","Marine Harvest (Scotland) Ltd","FB0119","M-33"]
["FS0245","Ardintoul","Marine Harvest (Scotland) Ltd","FB0119","M-21"]
["FS0247","Loch Harport","Marine Harvest (Scotland) Ltd","FB0119","M-27"]
["FS0248","Loch Duich","Marine Harvest (Scotland) Ltd","FB0119","M-21"]
["FS0249","Ardnish","Marine Harvest (Scotland) Ltd","FB0119","M-31"]
["FS0252","Cairidh","Marine Harvest (Scotland) Ltd","FB0119","M-28"]
["FS0253","Loch Spelve (B)","Scottish Sea Farms Ltd","FB0125","M-39"]
["FS0266","Loch An Sal","Finfish Ltd","FB0132","M-9"]
["FS0271","Kames Bay (west)","Kames Fish Farming Ltd","FB0134","M-40"]
["FS0292","Bight of Foraness","Grieg Seafood Shetland Ltd","FB0440","S-4"]
["FS0299","Dunstaffnage","Scottish Sea Farms Ltd","FB0125","M-36"]
["FS0333","East Voe Laxfirth","Grieg Seafood Shetland Ltd","FB0440","S-9"]
["FS0335","South Drumachro","Otter Ferry Seafish  Ltd.,","FB0012","M-46"]
["FS0336","Druimyeon Bay","The Scottish Salmon Company","FB0169","M-46"]
["FS0340","Kilerivagh / Petersport","The Scottish Salmon Company","FB0169","W-16"]
["FS0356","North Moine","Marine Harvest (Scotland) Ltd","FB0119","M-40"]
["FS0359","Kempie Bay","Scottish Sea Farms Ltd","FB0125","M-1"]
["FS0361","Sian Bay","Scottish Sea Farms Ltd","FB0125","M-1"]
["FS0382","Uyea Isle","Cooke Aquaculture Scotland Ltd","FB0095","S-2"]
["FS0390","Carness Bay","Cooke Aquaculture Scotland Ltd","FB0095","O-2"]
["FS0400","Snaraness","Scottish Sea Farms Ltd","FB0125","S-8b"]
["FS0407","Wick of Vatsetter","Cooke Aquaculture Scotland Ltd","FB0095","S-3"]
["FS0408","Poseidon","Grieg Seafood Shetland Ltd","FB0440","S-4"]
["FS0411","Vuiabeag","The Scottish Salmon Company","FB0169","W-2"]
["FS0413","Camas Glas","Marine Harvest (Scotland) Ltd","FB0119","M-34"]
["FS0423","Lamlash","The Scottish Salmon Company","FB0169","M-48"]
["FS0426","Loch Creran (B)","Scottish Sea Farms Ltd","FB0125","M-36"]
["FS0427","Fishnish (A)","Scottish Sea Farms Ltd","FB0125","M-35"]
["FS0430","Nevis A","Scottish Sea Farms Ltd","FB0125","M-23"]
["FS0431","Poll Loisgann","Finfish Ltd","FB0132","M-9"]
["FS0433","Langa Isle (East)","Grieg Seafood Shetland Ltd","FB0440","S-11"]
["FS0447","Papa","Grieg Seafood Shetland Ltd","FB0440","S-11"]
["FS0449","Baltasound Harbour","Balta Island Seafare Ltd","FB0220","S-1"]
["FS0451","Turness","Cooke Aquaculture Scotland Ltd","FB0095","S-2"]
["FS0462","Kames Bay (east)","Kames Fish Farming Ltd","FB0134","M-40"]
["FS0464","Ardmaddy","Marine Harvest (Scotland) Ltd","FB0119","M-40"]
["FS0465","Shuna Castle","Kames Fish Farming Ltd","FB0134","M-40"]
["FS0472","Wick of Belmont","Cooke Aquaculture Scotland Ltd","FB0095","S-2"]
["FS0477","Bow of Hascosay","Cooke Aquaculture Scotland Ltd","FB0095","S-3"]
["FS0480","Vaccasay","Marine Harvest (Scotland) Ltd","FB0119","W-11"]
["FS0481","North of Hoy","Scottish Sea Farms Ltd","FB0125","S-11"]
["FS0487","Drumbeg (Loch Dhrombaig)","Loch Duart Ltd","FB0398","M-7"]
["FS0489","Cole Deep","Grieg Seafood Shetland Ltd","FB0440","S-8b"]
["FS0494","Loch Meanenvagh","The Scottish Salmon Company","FB0169","W-15"]
["FS0501","Taing of Railsbrough Catfirth","Grieg Seafood Shetland Ltd","FB0440","S-9"]
["FS0502","Scotasay","Marine Harvest (Scotland) Ltd","FB0119","W-8"]
["FS0515","North Papa","Grieg Seafood Shetland Ltd","FB0440","S-11"]
["FS0517","Ardessie A","Wester Ross Fisheries Ltd","FB0447","M-14"]
["FS0519","Maol Ban","Marine Harvest (Scotland) Ltd","FB0119","M-28"]
["FS0531","Ornish Island","Marine Harvest (Scotland) Ltd","FB0119","W-18"]
["FS0546","Nevis C  (Ardintigh)","Scottish Sea Farms Ltd","FB0125","M-23"]
["FS0549","Tanera","Scottish Sea Farms Ltd","FB0125","M-10"]
["FS0559","Ardyne","The Scottish Salmon Company","FB0169","M-45"]
["FS0567","Furnace Quarry","The Scottish Salmon Company","FB0169","M-42"]
["FS0570","Strome","The Scottish Salmon Company","FB0169","M-20"]
["FS0590","Glenan Bay","The Scottish Salmon Company","FB0169","M-42"]
["FS0593","Inch Kenneth","The Scottish Salmon Company","FB0169","M-37"]
["FS0594","Aird","The Scottish Salmon Company","FB0169","M-17"]
["FS0595","Bay of Cleat (South)","Cooke Aquaculture Scotland Ltd","FB0095","O-1"]
["FS0597","Meil Bay","Cooke Aquaculture Scotland Ltd","FB0095","O-2"]
["FS0599","MacLean's Nose","Marine Harvest (Scotland) Ltd","FB0119","M-34"]
["FS0602","Sconser","Marine Harvest (Scotland) Ltd","FB0119","M-28"]
["FS0605","Creag an T'Sagairt (Loch Hourn)","Marine Harvest (Scotland) Ltd","FB0119","M-22"]
["FS0607","Breigeo  (Offshore)","Scottish Sea Farms Ltd","FB0125","S-11"]
["FS0608","Vidlin North","Scottish Sea Farms Ltd","FB0125","S-5"]
["FS0616","Nevis B","Scottish Sea Farms Ltd","FB0125","M-23"]
["FS0617","Loch Tuath","The Scottish Salmon Company","FB0169","M-37"]
["FS0621","Loch A Chairn Bhain","Loch Duart Ltd","FB0398","M-6"]
["FS0629","Poll Na Gille","Marine Harvest (Scotland) Ltd","FB0119","M-40"]
["FS0634","Loch Spelve (A)","Scottish Sea Farms Ltd","FB0125","M-39"]
["FS0637","Stead of Aithness","Cooke Aquaculture Scotland Ltd","FB0095","S-8b"]
["FS0645","Kirk Noust","Cooke Aquaculture Scotland Ltd","FB0095","O-2"]
["FS0646","Soay","Marine Harvest (Scotland) Ltd","FB0119","W-7"]
["FS0656","Djubawick","Cooke Aquaculture Scotland Ltd","FB0095","S-3"]
["FS0663","Kerrera B","Scottish Sea Farms Ltd","FB0125","M-36"]
["FS0666","Burrastow","Cooke Aquaculture Scotland Ltd","FB0095","S-10"]
["FS0671","Outer Bay (Loch Droighniche)","Loch Duart Ltd","FB0398","M-7"]
["FS0673","East of Hildasay","Scottish Sea Farms Ltd","FB0125","S-11"]
["FS0674","North Havra","Grieg Seafood Shetland Ltd","FB0440","S-11"]
["FS0675","Ardessie B","Wester Ross Fisheries Ltd","FB0447","M-14"]
["FS0683","Gob a Bharra Loch Fyne","The Scottish Salmon Company","FB0169","M-42"]
["FS0691","Sound of Hoy","Scottish Sea Farms Ltd","FB0125","S-11"]
["FS0694","Fishnish (B)","Scottish Sea Farms Ltd","FB0125","M-35"]
["FS0695","Shuna","Scottish Sea Farms Ltd","FB0125","M-36"]
["FS0696","Fiunary","Scottish Sea Farms Ltd","FB0125","M-35"]
["FS0698","Quarry Point","The Scottish Salmon Company","FB0169","M-42"]
{"$rows_left_out":136}