{"text_format":"1","workbook":"xlsx","n_sheets":12,"sheets":["Select an authority","CLA total number","CLA Accommodation","CLA Disability","CLA 3placements","DATA CLA","DATA CLA Acc","DATA CLA DIS","DATA CLA 3P","REF EA Name","REF CAS2","REF CAs"],"not_rendered":{"charts":6,"images":0,"macros":1,"external_links":0,"defined_names":8,"comments":0,"pivot_tables":0},"unopened":[],"bounds":{"document_bytes":16777216,"sheet_cells":100000,"rows_first":2000,"rows_last":500,"rows_between":2000,"halvings":0,"cell_chars":16384,"cell_head_chars":4096},"cells_cut":0,"cells_raw":0,"read":"whole","date_system":"1900"}

{"sheet":"Select an authority","index":0,"n_rows":33,"n_cols":5,"rows_kept":33,"cut":false,"hidden":false,"merged":[[27,3,30,8],[10,0,11,8],[12,0,17,8]]}
[4]
["Selecting an Authority and its Standard Comparator Authorities"]
["PLEASE REMEMBER TO 'ENABLE MACROS' - ",null,null,null,"Please select a Local Authority:"]
["THEY MAY HAVE BEEN DISABLED."]
["Last updated: 24/09/2020"]
[]
["Instructions on how to use this workbook available at:-"]
["LA Level Statistics - Children Looked After - User Instructions"]
["Children Looked After publications can be found at:-"]
["Children's Social Work Statistics"]
{"$rows_left_out":24}
{"sheet":"CLA total number","index":1,"n_rows":47,"n_cols":26,"rows_kept":47,"cut":false,"hidden":false,"merged":[[15,1,17,6],[11,1,12,6],[13,1,14,6]]}
[{"$f":"'DATA CLA'!A1","v":"Children Looked After: Number Looked After at 31 July 2013 to 2019"}]
[null,null,"select comparators:"]
[null,{"$f":"J3","v":28},null,null,null,null,null,null,null,{"$f":"VLOOKUP('Select an authority'!$A$1,'REF CAs'!$A$1:$F$32,2,0)","v":28}]
[null,{"$f":"J4","v":7},null,null,null,null,null,null,null,{"$f":"VLOOKUP('Select an authority'!$A$1,'REF CAs'!$A$1:$F$32,3,0)","v":7}]
[null,{"$f":"J5","v":26},null,null,null,null,null,null,null,{"$f":"VLOOKUP('Select an authority'!$A$1,'REF CAs'!$A$1:$F$32,4,0)","v":26}]
[null,{"$f":"J6","v":16},null,null,null,null,null,null,null,{"$f":"VLOOKUP('Select an authority'!$A$1,'REF CAs'!$A$1:$F$32,5,0)","v":16}]
[null,{"$f":"J7","v":3},null,null,null,null,null,null,null,{"$f":"VLOOKUP('Select an authority'!$A$1,'REF CAs'!$A$1:$F$32,6,0)","v":3}]
[]
[]
[]
{"$rows_left_out":38}
{"sheet":"CLA Accommodation","index":2,"n_rows":70,"n_cols":33,"rows_kept":70,"cut":false,"hidden":false,"merged":[[43,0,44,16],[25,23,25,24],[25,31,25,32],[11,1,13,4],[14,1,16,4],[17,1,22,4],[25,7,25,8],[25,15,25,16]]}
[{"$f":"'DATA CLA Acc'!A1","v":"Children Looked After: Type of Accommodation at 31 July 2016 to 2019"}]
[null,null,"select comparators:"]
[null,{"$f":"J3","v":28},null,null,null,null,null,null,null,{"$f":"VLOOKUP('Select an authority'!$A$1,'REF CAs'!$A$1:$F$32,2,0)","v":28}]
[null,15,null,null,null,null,null,null,null,{"$f":"VLOOKUP('Select an authority'!$A$1,'REF CAs'!$A$1:$F$32,3,0)","v":7}]
[null,{"$f":"J5","v":26},null,null,null,null,null,null,null,{"$f":"VLOOKUP('Select an authority'!$A$1,'REF CAs'!$A$1:$F$32,4,0)","v":26}]
[null,9,null,null,null,null,null,null,null,{"$f":"VLOOKUP('Select an authority'!$A$1,'REF CAs'!$A$1:$F$32,5,0)","v":16}]
[null,17,null,null,null,null,null,null,null,{"$f":"VLOOKUP('Select an authority'!$A$1,'REF CAs'!$A$1:$F$32,6,0)","v":3}]
[]
[]
[]
{"$rows_left_out":61}
{"sheet":"CLA Disability","index":3,"n_rows":49,"n_cols":17,"rows_kept":49,"cut":false,"hidden":false,"merged":[[11,1,13,4],[14,1,16,4],[17,1,19,4]]}
[{"$f":"'DATA CLA DIS'!A1","v":"Children Looked After: by disability status at 31 July 2016 to 2019"}]
[null,null,"select comparators:"]
[null,{"$f":"J3","v":28},null,null,null,null,null,null,null,{"$f":"VLOOKUP('Select an authority'!$A$1,'REF CAs'!$A$1:$F$32,2,0)","v":28}]
[null,{"$f":"J4","v":7},null,null,null,null,null,null,null,{"$f":"VLOOKUP('Select an authority'!$A$1,'REF CAs'!$A$1:$F$32,3,0)","v":7}]
[null,{"$f":"J5","v":26},null,null,null,null,null,null,null,{"$f":"VLOOKUP('Select an authority'!$A$1,'REF CAs'!$A$1:$F$32,4,0)","v":26}]
[null,{"$f":"J6","v":16},null,null,null,null,null,null,null,{"$f":"VLOOKUP('Select an authority'!$A$1,'REF CAs'!$A$1:$F$32,5,0)","v":16}]
[null,{"$f":"J7","v":3},null,null,null,null,null,null,null,{"$f":"VLOOKUP('Select an authority'!$A$1,'REF CAs'!$A$1:$F$32,6,0)","v":3}]
[]
[]
[]
{"$rows_left_out":40}
{"sheet":"CLA 3placements","index":4,"n_rows":43,"n_cols":25,"rows_kept":43,"cut":false,"hidden":false,"merged":[[11,1,12,3],[13,1,15,3],[16,1,17,3]]}
[{"$f":"'DATA CLA 3P'!A1","v":"Children Looked After: Number with 3 or more placements during the past year for those looked at 31 July 2016 to 2019"}]
[null,null,"select comparators:"]
[null,{"$f":"J3","v":28},null,null,null,null,null,null,null,{"$f":"VLOOKUP('Select an authority'!$A$1,'REF CAs'!$A$1:$F$32,2,0)","v":28},null,null,null,null,null,null,null,null,null,null,null,null,null,null,{"$f":"VLOOKUP('Select an authority'!$A$1,'REF CAs'!$A$1:$F$32,2,0)","v":28}]
[null,{"$f":"J4","v":7},null,null,null,null,null,null,null,{"$f":"VLOOKUP('Select an authority'!$A$1,'REF CAs'!$A$1:$F$32,3,0)","v":7},null,null,null,null,null,null,null,null,null,null,null,null,null,null,{"$f":"VLOOKUP('Select an authority'!$A$1,'REF CAs'!$A$1:$F$32,3,0)","v":7}]
[null,{"$f":"J5","v":26},null,null,null,null,null,null,null,{"$f":"VLOOKUP('Select an authority'!$A$1,'REF CAs'!$A$1:$F$32,4,0)","v":26},null,null,null,null,null,null,null,null,null,null,null,null,null,null,{"$f":"VLOOKUP('Select an authority'!$A$1,'REF CAs'!$A$1:$F$32,4,0)","v":26}]
[null,{"$f":"J6","v":16},null,null,null,null,null,null,null,{"$f":"VLOOKUP('Select an authority'!$A$1,'REF CAs'!$A$1:$F$32,5,0)","v":16},null,null,null,null,null,null,null,null,null,null,null,null,null,null,{"$f":"VLOOKUP('Select an authority'!$A$1,'REF CAs'!$A$1:$F$32,5,0)","v":16}]
[null,{"$f":"J7","v":3},null,null,null,null,null,null,null,{"$f":"VLOOKUP('Select an authority'!$A$1,'REF CAs'!$A$1:$F$32,6,0)","v":3},null,null,null,null,null,null,null,null,null,null,null,null,null,null,{"$f":"VLOOKUP('Select an authority'!$A$1,'REF CAs'!$A$1:$F$32,6,0)","v":3}]
[]
[]
[]
{"$rows_left_out":34}
{"sheet":"DATA CLA","index":5,"n_rows":41,"n_cols":25,"rows_kept":41,"cut":false,"hidden":false,"merged":[[2,9,2,13]]}
["Children Looked After: Number Looked After at 31 July 2013 to 2019"]
[]
["Total number of children looked after at 31 July 2013-2019",null,null,null,null,null,null,null,null,"Population Aged 0-17",null,null,null,null,null,null,null,"Total number of children looked after at 31 July 2013-2019 - rate per 1000, 0-17 population"]
[]
["Council",2013,2014,2015,2016,2017,2018,2019,null,2013,2014,2015,2016,2017,2018,2019,null,"Council",2013,2014,2015,2016,2017,2018,2019]
["Aberdeen City",606,577,549,553,590,549,542,null,37060,37182,37519,37775,38001,38418,38966,null,"Aberdeen City",{"$f":"IFERROR(B6*1000/J6,\"*\")","v":16.351861845655694},{"$f":"IFERROR(C6*1000/K6,\"*\")","v":15.518261524393523},{"$f":"IFERROR(D6*1000/L6,\"*\")","v":14.63258615634745},{"$f":"IFERROR(E6*1000/M6,\"*\")","v":14.639311714096625},{"$f":"IFERROR(F6*1000/N6,\"*\")","v":15.525907212968081},{"$f":"IFERROR(G6*1000/O6,\"*\")","v":14.290176479775106},{"$f":"IFERROR(H6*1000/P6,\"*\")","v":13.909562182415439}]
["Aberdeenshire",425,403,411,411,395,409,403,null,54048,54291,54806,54944,54908,54594,54634,null,"Aberdeenshire",{"$f":"IFERROR(B7*1000/J7,\"*\")","v":7.8633806986382471},7.4229614484905415,7.4991789220158376,7.4803436225975535,7.1938515334741746,7.4916657508151081,7.3763590438188675]
["Angus",253,272,261,238,255,251,244,null,22800,22608,22523,22339,22034,21759,21588,null,"Angus",11.096491228070175,12.031139419674451,11.58815433112818,10.654013160839787,11.573023509122265,11.535456592674295,11.302575504910136]
["Argyll & Bute",200,175,167,163,175,149,150,null,16175,15932,15639,15323,15141,14742,14566,null,"Argyll & Bute",12.364760432766616,10.984182776801406,10.678432124816165,10.637603602427722,11.55802126675913,10.10717677384344,10.297954139777564]
["City of Edinburgh",1402,1415,1419,1368,1349,1309,1234,null,82479,83504,84213,85026,86107,86866,87481,null,"City of Edinburgh",16.99826622534221,16.945296033722936,16.850130027430446,16.089196245854211,15.666554403242477,15.069187023691663,14.105920142659549]
{"$rows_left_out":32}
{"sheet":"DATA CLA Acc","index":6,"n_rows":51,"n_cols":36,"rows_kept":51,"cut":false,"hidden":false,"merged":[[3,33,3,34],[3,6,3,7],[3,15,3,16],[3,24,3,25]]}
["Children Looked After: Type of Accommodation at 31 July 2016 to 2019"]
[]
[null,2016,null,null,null,null,null,null,null,null,2017,null,null,null,null,null,null,null,null,2018,null,null,null,null,null,null,null,null,2019]
[null,"In the community",null,null,null,null,"In residential accommodation",null,null,null,"In the community",null,null,null,null,"In residential accommodation",null,null,null,"In the community",null,null,null,null,"In residential accommodation",null,null,null,"In the community",null,null,null,null,"In residential accommodation"]
[null,"At home with parents","With friends / relatives","With foster carers provided by LA","With foster carers purchased by LA","In other community(1)","In local authority home/ Voluntary Home ","In other residential care(2)","Total",null,"At home with parents","With friends / relatives","With foster carers provided by LA","With foster carers purchased by LA","In other community(1)","In local authority home/ Voluntary Home ","In other residential care(2)","Total",null,"At home with parents","With friends / relatives","With foster carers provided by LA","With foster carers purchased by LA","In other community(1)","In local authority home/ Voluntary Home ","In other residential care(2)","Total",null,"At home with parents","With friends / relatives","With foster carers provided by LA","With foster carers purchased by LA","In other community(1)","In local authority home/ Voluntary Home ","In other residential care(2)","Total"]
["Council"]
["Aberdeen City",115,119,109,138,6,22,44,553,null,108,112,113,175,14,23,45,590,null,75,115,94,182,21,19,43,549,null,97,98,81,193,22,16,35,542]
["Aberdeenshire",109,63,150,20,10,28,31,411,null,80,66,160,22,12,23,32,395,null,81,76,142,26,19,29,36,409,null,68,75,139,36,14,31,40,403]
["Angus",73,36,92,6,10,7,14,238,null,65,63,95,7,5,6,14,255,null,65,63,82,13,7,5,16,251,null,61,65,80,7,6,8,17,244]
["Argyll & Bute",48,44,46,"*","*",10,10,163,null,52,58,37,"*","*",13,9,175,null,40,45,34,"*","*",18,9,149,null,46,42,32,"*","*",15,10,150]
{"$rows_left_out":42}
{"sheet":"DATA CLA DIS","index":7,"n_rows":41,"n_cols":13,"rows_kept":41,"cut":false,"hidden":false,"merged":[]}
["Children Looked After: by disability status at 31 July 2016 to 2019"]
[]
[]
[null,2016,null,null,2017,null,null,2018,null,null,2019]
["Council","No. of children looked after ","No. of children looked after with  known additional support needs","% of children looked after with known additional support needs","No. of children looked after ","No. of children looked after with a disability","% of children looked after with a disability","No. of children looked after ","No. of children looked after with a disability","% of children looked after with a disability","No. of children looked after ","No. of children looked after with a disability","% of children looked after with a disability"]
["Aberdeen City",553,144,0.26,590,147,0.24915254237288137,549,128,{"$f":"I6/H6","v":0.2331511839708561},542,142,{"$f":"L6/K6","v":0.26199261992619927}]
["Aberdeenshire",411,70,0.17,395,74,0.18734177215189873,409,85,0.20782396088019561,403,80,0.19851116625310175]
["Angus",238,46,0.19,255,64,0.25098039215686274,251,58,0.23107569721115537,244,46,0.18852459016393441]
["Argyll & Bute",163,36,0.22,175,36,0.20571428571428571,149,29,0.19463087248322147,150,34,0.22666666666666666]
["City of Edinburgh",1368,72,0.05,1349,73,5.4114158636026685E-2,1309,62,4.7364400305576773E-2,1234,57,4.6191247974068074E-2]
{"$rows_left_out":32}
{"sheet":"DATA CLA 3P","index":8,"n_rows":43,"n_cols":17,"rows_kept":43,"cut":false,"hidden":false,"merged":[]}
["Children Looked After: Number with 3 or more placements during the past year for those looked at 31 July 2016 to 2019"]
[]
[null,null,2016,null,null,null,2017,null,null,null,2018,null,null,null,2019]
[null,null,"Number of children looked after ","Number with 3 or more placements","Percentage with 3 or more placements",null,"Number of children looked after ","Number with 3 or more placements","Percentage with 3 or more placements",null,"Number of children looked after ","Number with 3 or more placements","Percentage with 3 or more placements",null,"Number of children looked after ","Number with 3 or more placements","Percentage with 3 or more placements"]
["Council"]
["Aberdeen City",null,553,31,5.6057866184448461E-2,null,590,49,8.3050847457627114E-2,null,549,31,{"$f":"L6/K6","v":5.6466302367941715E-2},null,542,29,{"$f":"P6/O6","v":5.350553505535055E-2}]
["Aberdeenshire",null,411,16,3.8929440389294405E-2,null,395,21,5.3164556962025315E-2,null,409,20,4.8899755501222497E-2,null,403,29,7.1960297766749379E-2]
["Angus",null,238,24,0.10084033613445378,null,255,19,7.4509803921568626E-2,null,251,31,0.12350597609561753,null,244,18,7.3770491803278687E-2]
["Argyll & Bute",null,163,7,4.2944785276073622E-2,null,175,14,0.08,null,149,6,4.0268456375838924E-2,null,150,9,0.06]
["City of Edinburgh",null,1368,112,8.1871345029239762E-2,null,1349,85,6.3009636767976274E-2,null,1309,94,7.1810542398777696E-2,null,1234,91,7.3743922204213941E-2]
{"$rows_left_out":34}
{"sheet":"REF EA Name","index":9,"n_rows":35,"n_cols":2,"rows_kept":35,"cut":false,"hidden":true,"merged":[]}
["EA Code","EA Name"]
[]
[100,"Aberdeen City"]
[110,"Aberdeenshire"]
[120,"Angus"]
[130,"Argyll & Bute"]
[230,"City of Edinburgh"]
[150,"Clackmannanshire"]
[170,"Dumfries and Galloway"]
[180,"Dundee City"]
{"$rows_left_out":26}
{"sheet":"REF CAS2","index":10,"n_rows":33,"n_cols":12,"rows_kept":33,"cut":false,"hidden":true,"merged":[]}
[]
[100,"Aberdeen City","City of Edinburgh","****","Dundee City","***","South Ayrshire","***","Argyll and Bute","***","Renfrewshire","***"]
[110,"Aberdeenshire","Stirling","****","Perth and Kinross","****","Highland","****","Scottish Borders","****","South Lanarkshire","****"]
[120,"Angus","Highland","*****","Dumfries and Galloway","*****","Moray","*****","Scottish Borders","****","South Ayrshire","****"]
[130,"Argyll & Bute","South Ayrshire","*****","Dumfries and Galloway","****","Scottish Borders","****","Highland","****","Angus","****"]
[230,"City of Edinburgh","Aberdeen City","****","Dundee City","**","South Ayrshire","**","Argyll and Bute","**","Renfrewshire","**"]
[150,"Clackmannanshire","North Lanarkshire","*****","West Lothian","****","Falkirk","****","South Lanarkshire","****","East Ayrshire","****"]
[170,"Dumfries & Galloway","Angus","*****","Highland","****","Argyll and Bute","****","Scottish Borders","****","Moray","****"]
[180,"Dundee City","Aberdeen City","***","Renfrewshire","***","Dumfries and Galloway","***","Inverclyde","***","South Ayrshire","***"]
[190,"East Ayrshire","North Lanarkshire","*****","Clackmannanshire","****","Falkirk","****","North Ayrshire","****","West Lothian","****"]
{"$rows_left_out":24}
{"sheet":"REF CAs","index":11,"n_rows":70,"n_cols":11,"rows_kept":70,"cut":false,"hidden":true,"merged":[]}
[1,{"$f":"INDEX($J$1:$K$32,MATCH(C39,$J$1:$J$32,0),2)","v":5},{"$f":"INDEX($J$1:$K$32,MATCH(D39,$J$1:$J$32,0),2)","v":8},28,4,25,null,null,"Aberdeen City","Aberdeen City",1]
[2,{"$f":"INDEX($J$1:$K$32,MATCH(C40,$J$1:$J$32,0),2)","v":30},24,16,26,29,null,null,"Aberdeenshire","Aberdeenshire",2]
[3,{"$f":"INDEX($J$1:$K$32,MATCH(C41,$J$1:$J$32,0),2)","v":16},7,19,26,28,null,null,"Angus","Angus",3]
[4,{"$f":"INDEX($J$1:$K$32,MATCH(C42,$J$1:$J$32,0),2)","v":28},7,26,16,3,null,null,"Argyll and Bute","Argyll and Bute",4]
[5,{"$f":"INDEX($J$1:$K$32,MATCH(C43,$J$1:$J$32,0),2)","v":1},8,28,4,25,null,null,"Clackmannanshire","City of Edinburgh",5]
[6,{"$f":"INDEX($J$1:$K$32,MATCH(C44,$J$1:$J$32,0),2)","v":22},32,13,29,9,null,null,"Dumfries and Galloway","Clackmannanshire",6]
[7,{"$f":"INDEX($J$1:$K$32,MATCH(C45,$J$1:$J$32,0),2)","v":3},16,4,26,19,null,null,"Dundee City","Dumfries and Galloway",7]
[8,{"$f":"INDEX($J$1:$K$32,MATCH(C46,$J$1:$J$32,0),2)","v":1},25,7,17,28,null,null,"East Ayrshire","Dundee City",8]
[9,{"$f":"INDEX($J$1:$K$32,MATCH(C47,$J$1:$J$32,0),2)","v":22},6,13,21,32,null,null,"East Dunbartonshire","East Ayrshire",9]
[10,{"$f":"INDEX($J$1:$K$32,MATCH(C48,$J$1:$J$32,0),2)","v":12},30,11,2,24,null,null,"East Lothian","East Dunbartonshire",10]
{"$rows_left_out":60}