{"text_format":"1","workbook":"xlsx","n_sheets":14,"sheets":["Introduction","Data Centre Detail","ICT Requirements","Data Centre Report","Options Report","Summary Report","Assumptions Report","Scenario Report","Decision","ICT Provision Report","Defaults","Look Up Tables","Graphs","Scenario History"],"not_rendered":{"charts":16,"images":5,"macros":1,"external_links":0,"defined_names":91,"comments":0,"pivot_tables":0},"unopened":[],"bounds":{"document_bytes":16777216,"sheet_cells":100000,"rows_first":2000,"rows_last":500,"rows_between":2000,"halvings":0,"cell_chars":16384,"cell_head_chars":4096},"cells_cut":0,"cells_raw":0,"read":"whole","date_system":"1900"}

{"sheet":"Introduction","index":0,"n_rows":44,"n_cols":15,"rows_kept":44,"cut":false,"hidden":false,"merged":[[43,0,43,15],[10,4,10,14],[11,4,11,14],[26,9,26,14],[24,1,25,7],[29,2,29,7],[30,2,30,7],[31,2,31,7],[32,2,32,7],[33,2,33,7],[29,9,29,14],[34,2,34,7],[28,11,28,12],[0,0,0,15],[4,4,4,8],[5,4,5,8],[6,4,6,8],[7,4,7,8]]}
["Scottish Public Sector Data Hosting and Data Centre Efficiency Assessment Tool"]
[]
["Step 1:","Enter information about your organisation:"]
[]
[null,"Organisation name",null,null,null,null,null,null,null,null,"Utility costs",null,"Tariff",null,"Real Escalation"]
[null,"User name",null,null,null,null,null,null,null,null,"  Electricity",null,null,"p/kWh",0.04]
[null,"User email",null,null,null,null,null,null,null,null,"  Natural Gas",null,null,"p/kWh",0.04]
[null,"No of ICT users",null,null,null,null,null,null,null,null,"  Generator Fuel",null,null,"p/kWh",0.04]
{"$rows_left_out":37}
{"sheet":"Data Centre Detail","index":1,"n_rows":220,"n_cols":15,"rows_kept":220,"cut":false,"hidden":false,"merged":[[4,3,4,5],[4,12,4,14],[4,9,4,11],[4,6,4,8],[71,4,75,5],[71,7,75,8],[71,10,75,11],[71,13,75,14]]}
[null,"Data Centre/Server Room Information"]
[]
[null,"Number of Data Centres/Server Rooms",null,{"$f":"Introduction!E9","v":1}]
[]
[null,"Data Centre",null,1,null,null,2,null,null,3,null,null,4]
[null,"Name"]
[null,"Location (Select closest town/city)"]
[null,"Detail"]
{"$rows_left_out":213}
{"sheet":"ICT Requirements","index":2,"n_rows":63,"n_cols":13,"rows_kept":63,"cut":false,"hidden":false,"merged":[]}
[null,"ICT Provision and Requirements"]
[]
[null,"Staff Costs"]
[null,"  Data Centre staff costs",{"$f":"'Data Centre Detail'!E150","v":0}]
[null,"  Other ICT staff costs"]
[null,"      If known, enter annual staff costs"]
[null,"        Or"]
[null,"     Enter number of staff"]
{"$rows_left_out":56}
{"sheet":"Data Centre Report","index":3,"n_rows":38,"n_cols":19,"rows_kept":38,"cut":false,"hidden":false,"merged":[[7,12,7,16],[8,12,8,16],[6,7,6,11],[7,7,7,11],[8,7,8,11],[0,0,0,21],[1,0,1,21],[2,0,2,21],[31,18,32,20],[32,0,32,1],[31,3,32,5],[31,8,32,10],[31,13,32,15],[30,2,30,3],[6,2,6,6],[7,2,7,6],[8,2,8,6],[6,17,6,21],[7,17,7,21],[8,17,8,21],[6,12,6,16]]}
[{"$f":"Introduction!E5","v":0}]
["Data Centre Status Report"]
[{"$f":"Introduction!E11","v":0}]
[]
["Number of Data Centres Owned/Used",null,null,{"$f":"Introduction!E9","v":1}]
[]
["Location",null,{"$f":"'Data Centre Detail'!D7","v":0},null,null,null,null,{"$f":"'Data Centre Detail'!G7","v":0},null,null,null,null,{"$f":"'Data Centre Detail'!J7","v":0},null,null,null,null,{"$f":"'Data Centre Detail'!M7","v":0}]
["Type",null,{"$f":"'Data Centre Detail'!D9","v":0},null,null,null,null,{"$f":"'Data Centre Detail'!G9","v":0},null,null,null,null,{"$f":"'Data Centre Detail'!J9","v":0},null,null,null,null,{"$f":"'Data Centre Detail'!M9","v":0}]
{"$rows_left_out":31}
{"sheet":"Options Report","index":4,"n_rows":49,"n_cols":12,"rows_kept":49,"cut":false,"hidden":false,"merged":[[1,0,1,11],[2,0,2,11]]}
[null,null,null,null,null,{"$f":"Introduction!E5","v":0}]
["ICT Provision Options Appraisal "]
[{"$f":"Introduction!E11","v":0}]
[]
[]
[null,null,null,null,"Existing Total ICT Costs",null,{"$f":"L26+'ICT Requirements'!C11+'ICT Requirements'!C14","v":0}]
[]
[null,null,null,null,"Potential Annual Savings",null,{"$f":"L21","v":0}]
{"$rows_left_out":42}
{"sheet":"Summary Report","index":5,"n_rows":33,"n_cols":7,"rows_kept":33,"cut":false,"hidden":false,"merged":[[0,0,0,10],[32,0,32,10],[33,7,33,8],[33,2,33,4],[1,0,1,10],[2,0,2,10],[13,0,13,10]]}
[{"$f":"Introduction!E5","v":0}]
["ICT Provision Options Appraisal "]
[{"$f":"Introduction!E11","v":0}]
[]
[]
[null,null,null,null,"Existing Data Centre TCO",null,{"$f":"SUM(Graphs!C51:C54)","v":0}]
[]
[null,null,null,null,"Existing ICT Cost of Provision",null,{"$f":"'Options Report'!G6","v":0}]
{"$rows_left_out":26}
{"sheet":"Assumptions Report","index":6,"n_rows":289,"n_cols":14,"rows_kept":289,"cut":false,"hidden":false,"merged":[[0,0,0,14],[1,1,1,14],[17,2,17,4],[17,5,17,7],[17,8,17,10],[17,11,17,13]]}
[{"$f":"Introduction!E5","v":0}]
[null,"Assumptions Report"]
[]
[null,"Select Scenario to View:"]
[null,"Option 3",{"$f":"VLOOKUP(B5,'Look Up Tables'!A120:B126,2,0)*12","v":{"$error":"#N/A"}}]
[]
[null,"User name",{"$f":"IFERROR(OFFSET('Scenario History'!C5,0,$C$5),\"\")","v":""}]
[null,"User email",{"$f":"IFERROR(OFFSET('Scenario History'!C6,0,$C$5),\"\")","v":""}]
{"$rows_left_out":282}
{"sheet":"Scenario Report","index":7,"n_rows":27,"n_cols":14,"rows_kept":27,"cut":false,"hidden":false,"merged":[[0,0,0,13],[1,0,1,13],[18,4,18,13],[25,2,25,3],[26,2,26,3],[20,2,20,3],[21,2,21,3],[22,2,22,3],[23,2,23,3],[24,2,24,3],[13,2,13,3],[14,2,14,3],[5,1,7,1],[18,0,19,0],[18,1,19,1],[18,2,19,3],[8,2,8,3],[9,2,9,3],[10,2,10,3],[11,2,11,3],[12,2,12,3],[5,0,7,0],[5,2,7,3],[5,13,7,13],[5,4,7,4],[6,5,6,6],[6,7,6,8],[6,9,6,10],[6,11,6,12],[5,5,5,12]]}
[{"$f":"Introduction!E5","v":0}]
["Scenario Report"]
[]
["Data Centre Costs and Power Utilisation Effectiveness"]
[]
["Scenario",null,"Description",null,"Review Date","TCO and PUE",null,null,null,null,null,null,null,"ICT Delivery Cost"]
[null,null,null,null,null,1,null,2,null,3,null,4]
[null,null,null,null,null,"TCO","PUE","TCO","PUE","TCO","PUE","TCO","PUE"]
{"$rows_left_out":20}
{"sheet":"Decision","index":8,"n_rows":94,"n_cols":11,"rows_kept":94,"cut":false,"hidden":true,"merged":[]}
[]
[]
["Own Data Centre"]
["Name",{"$f":"'ICT Requirements'!C22","v":0},{"$f":"'ICT Requirements'!D22","v":0},{"$f":"'ICT Requirements'!E22","v":0},{"$f":"'ICT Requirements'!F22","v":0},{"$f":"'ICT Requirements'!G22","v":0},{"$f":"'ICT Requirements'!H22","v":0},{"$f":"'ICT Requirements'!I22","v":0},{"$f":"'ICT Requirements'!J22","v":0},{"$f":"'ICT Requirements'!K22","v":0},{"$f":"'ICT Requirements'!L22","v":0}]
["Location",{"$f":"IF(B4='Data Centre Detail'!$D$6,'Data Centre Detail'!$D$7,IF(B4='Data Centre Detail'!$G$6,'Data Centre Detail'!$G$7,IF(B4='Data Centre Detail'!$J$6,'Data Centre Detail'!$J$7,IF(B4='Data Centre Detail'!$M$6,'Data Centre Detail'!$M$7,\"\"))))","v":0},{"$f":"IF(C4='Data Centre Detail'!$D$6,'Data Centre Detail'!$D$7,IF(C4='Data Centre Detail'!$G$6,'Data Centre Detail'!$G$7,IF(C4='Data Centre Detail'!$J$6,'Data Centre Detail'!$J$7,IF(C4='Data Centre Detail'!$M$6,'Data Centre Detail'!$M$7,\"\"))))","v":0},{"$f":"IF(D4='Data Centre Detail'!$D$6,'Data Centre Detail'!$D$7,IF(D4='Data Centre Detail'!$G$6,'Data Centre Detail'!$G$7,IF(D4='Data Centre Detail'!$J$6,'Data Centre Detail'!$J$7,IF(D4='Data Centre Detail'!$M$6,'Data Centre Detail'!$M$7,\"\"))))","v":0},{"$f":"IF(E4='Data Centre Detail'!$D$6,'Data Centre Detail'!$D$7,IF(E4='Data Centre Detail'!$G$6,'Data Centre Detail'!$G$7,IF(E4='Data Centre Detail'!$J$6,'Data Centre Detail'!$J$7,IF(E4='Data Centre Detail'!$M$6,'Data Centre Detail'!$M$7,\"\"))))","v":0},{"$f":"IF(F4='Data Centre Detail'!$D$6,'Data Centre Detail'!$D$7,IF(F4='Data Centre Detail'!$G$6,'Data Centre Detail'!$G$7,IF(F4='Data Centre Detail'!$J$6,'Data Centre Detail'!$J$7,IF(F4='Data Centre Detail'!$M$6,'Data Centre Detail'!$M$7,\"\"))))","v":0},{"$f":"IF(G4='Data Centre Detail'!$D$6,'Data Centre Detail'!$D$7,IF(G4='Data Centre Detail'!$G$6,'Data Centre Detail'!$G$7,IF(G4='Data Centre Detail'!$J$6,'Data Centre Detail'!$J$7,IF(G4='Data Centre Detail'!$M$6,'Data Centre Detail'!$M$7,\"\"))))","v":0},{"$f":"IF(H4='Data Centre Detail'!$D$6,'Data Centre Detail'!$D$7,IF(H4='Data Centre Detail'!$G$6,'Data Centre Detail'!$G$7,IF(H4='Data Centre Detail'!$J$6,'Data Centre Detail'!$J$7,IF(H4='Data Centre Detail'!$M$6,'Data Centre Detail'!$M$7,\"\"))))","v":0},{"$f":"IF(I4='Data Centre Detail'!$D$6,'Data Centre Detail'!$D$7,IF(I4='Data Centre Detail'!$G$6,'Data Centre Detail'!$G$7,IF(I4='Data Centre Detail'!$J$6,'Data Centre Detail'!$J$7,IF(I4='Data Centre Detail'!$M$6,'Data Centre Detail'!$M$7,\"\"))))","v":0},{"$f":"IF(J4='Data Centre Detail'!$D$6,'Data Centre Detail'!$D$7,IF(J4='Data Centre Detail'!$G$6,'Data Centre Detail'!$G$7,IF(J4='Data Centre Detail'!$J$6,'Data Centre Detail'!$J$7,IF(J4='Data Centre Detail'!$M$6,'Data Centre Detail'!$M$7,\"\"))))","v":0},{"$f":"IF(K4='Data Centre Detail'!$D$6,'Data Centre Detail'!$D$7,IF(K4='Data Centre Detail'!$G$6,'Data Centre Detail'!$G$7,IF(K4='Data Centre Detail'!$J$6,'Data Centre Detail'!$J$7,IF(K4='Data Centre Detail'!$M$6,'Data Centre Detail'!$M$7,\"\"))))","v":0}]
["Total Data Centre Costs",{"$f":"IF(B$4='Data Centre Detail'!$D$6,'Data Centre Detail'!$D$220,IF(B$4='Data Centre Detail'!$G$6,'Data Centre Detail'!$G$220,IF(B$4='Data Centre Detail'!$J$6,'Data Centre Detail'!$J$220,IF(B$4='Data Centre Detail'!$M$6,'Data Centre Detail'!$M$220,0))))","v":0},{"$f":"IF(C$4='Data Centre Detail'!$D$6,'Data Centre Detail'!$D$220,IF(C$4='Data Centre Detail'!$G$6,'Data Centre Detail'!$G$220,IF(C$4='Data Centre Detail'!$J$6,'Data Centre Detail'!$J$220,IF(C$4='Data Centre Detail'!$M$6,'Data Centre Detail'!$M$220,0))))","v":0},{"$f":"IF(D$4='Data Centre Detail'!$D$6,'Data Centre Detail'!$D$220,IF(D$4='Data Centre Detail'!$G$6,'Data Centre Detail'!$G$220,IF(D$4='Data Centre Detail'!$J$6,'Data Centre Detail'!$J$220,IF(D$4='Data Centre Detail'!$M$6,'Data Centre Detail'!$M$220,0))))","v":0},{"$f":"IF(E$4='Data Centre Detail'!$D$6,'Data Centre Detail'!$D$220,IF(E$4='Data Centre Detail'!$G$6,'Data Centre Detail'!$G$220,IF(E$4='Data Centre Detail'!$J$6,'Data Centre Detail'!$J$220,IF(E$4='Data Centre Detail'!$M$6,'Data Centre Detail'!$M$220,0))))","v":0},{"$f":"IF(F$4='Data Centre Detail'!$D$6,'Data Centre Detail'!$D$220,IF(F$4='Data Centre Detail'!$G$6,'Data Centre Detail'!$G$220,IF(F$4='Data Centre Detail'!$J$6,'Data Centre Detail'!$J$220,IF(F$4='Data Centre Detail'!$M$6,'Data Centre Detail'!$M$220,0))))","v":0},{"$f":"IF(G$4='Data Centre Detail'!$D$6,'Data Centre Detail'!$D$220,IF(G$4='Data Centre Detail'!$G$6,'Data Centre Detail'!$G$220,IF(G$4='Data Centre Detail'!$J$6,'Data Centre Detail'!$J$220,IF(G$4='Data Centre Detail'!$M$6,'Data Centre Detail'!$M$220,0))))","v":0},{"$f":"IF(H$4='Data Centre Detail'!$D$6,'Data Centre Detail'!$D$220,IF(H$4='Data Centre Detail'!$G$6,'Data Centre Detail'!$G$220,IF(H$4='Data Centre Detail'!$J$6,'Data Centre Detail'!$J$220,IF(H$4='Data Centre Detail'!$M$6,'Data Centre Detail'!$M$220,0))))","v":0},{"$f":"IF(I$4='Data Centre Detail'!$D$6,'Data Centre Detail'!$D$220,IF(I$4='Data Centre Detail'!$G$6,'Data Centre Detail'!$G$220,IF(I$4='Data Centre Detail'!$J$6,'Data Centre Detail'!$J$220,IF(I$4='Data Centre Detail'!$M$6,'Data Centre Detail'!$M$220,0))))","v":0},{"$f":"IF(J$4='Data Centre Detail'!$D$6,'Data Centre Detail'!$D$220,IF(J$4='Data Centre Detail'!$G$6,'Data Centre Detail'!$G$220,IF(J$4='Data Centre Detail'!$J$6,'Data Centre Detail'!$J$220,IF(J$4='Data Centre Detail'!$M$6,'Data Centre Detail'!$M$220,0))))","v":0},{"$f":"IF(K$4='Data Centre Detail'!$D$6,'Data Centre Detail'!$D$220,IF(K$4='Data Centre Detail'!$G$6,'Data Centre Detail'!$G$220,IF(K$4='Data Centre Detail'!$J$6,'Data Centre Detail'!$J$220,IF(K$4='Data Centre Detail'!$M$6,'Data Centre Detail'!$M$220,0))))","v":0}]
["No of Racks",{"$f":"IF(B$4='Data Centre Detail'!$D$6,'Data Centre Detail'!$D$26,IF(B$4='Data Centre Detail'!$G$6,'Data Centre Detail'!$G$26,IF(B$4='Data Centre Detail'!$J$6,'Data Centre Detail'!$J$26,IF(B$4='Data Centre Detail'!$M$6,'Data Centre Detail'!$M$26,0))))","v":0},{"$f":"IF(C$4='Data Centre Detail'!$D$6,'Data Centre Detail'!$D$26,IF(C$4='Data Centre Detail'!$G$6,'Data Centre Detail'!$G$26,IF(C$4='Data Centre Detail'!$J$6,'Data Centre Detail'!$J$26,IF(C$4='Data Centre Detail'!$M$6,'Data Centre Detail'!$M$26,0))))","v":0},{"$f":"IF(D$4='Data Centre Detail'!$D$6,'Data Centre Detail'!$D$26,IF(D$4='Data Centre Detail'!$G$6,'Data Centre Detail'!$G$26,IF(D$4='Data Centre Detail'!$J$6,'Data Centre Detail'!$J$26,IF(D$4='Data Centre Detail'!$M$6,'Data Centre Detail'!$M$26,0))))","v":0},{"$f":"IF(E$4='Data Centre Detail'!$D$6,'Data Centre Detail'!$D$26,IF(E$4='Data Centre Detail'!$G$6,'Data Centre Detail'!$G$26,IF(E$4='Data Centre Detail'!$J$6,'Data Centre Detail'!$J$26,IF(E$4='Data Centre Detail'!$M$6,'Data Centre Detail'!$M$26,0))))","v":0},{"$f":"IF(F$4='Data Centre Detail'!$D$6,'Data Centre Detail'!$D$26,IF(F$4='Data Centre Detail'!$G$6,'Data Centre Detail'!$G$26,IF(F$4='Data Centre Detail'!$J$6,'Data Centre Detail'!$J$26,IF(F$4='Data Centre Detail'!$M$6,'Data Centre Detail'!$M$26,0))))","v":0},{"$f":"IF(G$4='Data Centre Detail'!$D$6,'Data Centre Detail'!$D$26,IF(G$4='Data Centre Detail'!$G$6,'Data Centre Detail'!$G$26,IF(G$4='Data Centre Detail'!$J$6,'Data Centre Detail'!$J$26,IF(G$4='Data Centre Detail'!$M$6,'Data Centre Detail'!$M$26,0))))","v":0},{"$f":"IF(H$4='Data Centre Detail'!$D$6,'Data Centre Detail'!$D$26,IF(H$4='Data Centre Detail'!$G$6,'Data Centre Detail'!$G$26,IF(H$4='Data Centre Detail'!$J$6,'Data Centre Detail'!$J$26,IF(H$4='Data Centre Detail'!$M$6,'Data Centre Detail'!$M$26,0))))","v":0},{"$f":"IF(I$4='Data Centre Detail'!$D$6,'Data Centre Detail'!$D$26,IF(I$4='Data Centre Detail'!$G$6,'Data Centre Detail'!$G$26,IF(I$4='Data Centre Detail'!$J$6,'Data Centre Detail'!$J$26,IF(I$4='Data Centre Detail'!$M$6,'Data Centre Detail'!$M$26,0))))","v":0},{"$f":"IF(J$4='Data Centre Detail'!$D$6,'Data Centre Detail'!$D$26,IF(J$4='Data Centre Detail'!$G$6,'Data Centre Detail'!$G$26,IF(J$4='Data Centre Detail'!$J$6,'Data Centre Detail'!$J$26,IF(J$4='Data Centre Detail'!$M$6,'Data Centre Detail'!$M$26,0))))","v":0},{"$f":"IF(K$4='Data Centre Detail'!$D$6,'Data Centre Detail'!$D$26,IF(K$4='Data Centre Detail'!$G$6,'Data Centre Detail'!$G$26,IF(K$4='Data Centre Detail'!$J$6,'Data Centre Detail'!$J$26,IF(K$4='Data Centre Detail'!$M$6,'Data Centre Detail'!$M$26,0))))","v":0}]
["No of Servers",{"$f":"IF(B$4='Data Centre Detail'!$D$6,'Data Centre Detail'!$D$29,IF(B$4='Data Centre Detail'!$G$6,'Data Centre Detail'!$G$29,IF(B$4='Data Centre Detail'!$J$6,'Data Centre Detail'!$J$29,IF(B$4='Data Centre Detail'!$M$6,'Data Centre Detail'!$M$29,0))))","v":0},{"$f":"IF(C$4='Data Centre Detail'!$D$6,'Data Centre Detail'!$D$29,IF(C$4='Data Centre Detail'!$G$6,'Data Centre Detail'!$G$29,IF(C$4='Data Centre Detail'!$J$6,'Data Centre Detail'!$J$29,IF(C$4='Data Centre Detail'!$M$6,'Data Centre Detail'!$M$29,0))))","v":0},{"$f":"IF(D$4='Data Centre Detail'!$D$6,'Data Centre Detail'!$D$29,IF(D$4='Data Centre Detail'!$G$6,'Data Centre Detail'!$G$29,IF(D$4='Data Centre Detail'!$J$6,'Data Centre Detail'!$J$29,IF(D$4='Data Centre Detail'!$M$6,'Data Centre Detail'!$M$29,0))))","v":0},{"$f":"IF(E$4='Data Centre Detail'!$D$6,'Data Centre Detail'!$D$29,IF(E$4='Data Centre Detail'!$G$6,'Data Centre Detail'!$G$29,IF(E$4='Data Centre Detail'!$J$6,'Data Centre Detail'!$J$29,IF(E$4='Data Centre Detail'!$M$6,'Data Centre Detail'!$M$29,0))))","v":0},{"$f":"IF(F$4='Data Centre Detail'!$D$6,'Data Centre Detail'!$D$29,IF(F$4='Data Centre Detail'!$G$6,'Data Centre Detail'!$G$29,IF(F$4='Data Centre Detail'!$J$6,'Data Centre Detail'!$J$29,IF(F$4='Data Centre Detail'!$M$6,'Data Centre Detail'!$M$29,0))))","v":0},{"$f":"IF(G$4='Data Centre Detail'!$D$6,'Data Centre Detail'!$D$29,IF(G$4='Data Centre Detail'!$G$6,'Data Centre Detail'!$G$29,IF(G$4='Data Centre Detail'!$J$6,'Data Centre Detail'!$J$29,IF(G$4='Data Centre Detail'!$M$6,'Data Centre Detail'!$M$29,0))))","v":0},{"$f":"IF(H$4='Data Centre Detail'!$D$6,'Data Centre Detail'!$D$29,IF(H$4='Data Centre Detail'!$G$6,'Data Centre Detail'!$G$29,IF(H$4='Data Centre Detail'!$J$6,'Data Centre Detail'!$J$29,IF(H$4='Data Centre Detail'!$M$6,'Data Centre Detail'!$M$29,0))))","v":0},{"$f":"IF(I$4='Data Centre Detail'!$D$6,'Data Centre Detail'!$D$29,IF(I$4='Data Centre Detail'!$G$6,'Data Centre Detail'!$G$29,IF(I$4='Data Centre Detail'!$J$6,'Data Centre Detail'!$J$29,IF(I$4='Data Centre Detail'!$M$6,'Data Centre Detail'!$M$29,0))))","v":0},{"$f":"IF(J$4='Data Centre Detail'!$D$6,'Data Centre Detail'!$D$29,IF(J$4='Data Centre Detail'!$G$6,'Data Centre Detail'!$G$29,IF(J$4='Data Centre Detail'!$J$6,'Data Centre Detail'!$J$29,IF(J$4='Data Centre Detail'!$M$6,'Data Centre Detail'!$M$29,0))))","v":0},{"$f":"IF(K$4='Data Centre Detail'!$D$6,'Data Centre Detail'!$D$29,IF(K$4='Data Centre Detail'!$G$6,'Data Centre Detail'!$G$29,IF(K$4='Data Centre Detail'!$J$6,'Data Centre Detail'!$J$29,IF(K$4='Data Centre Detail'!$M$6,'Data Centre Detail'!$M$29,0))))","v":0}]
{"$rows_left_out":87}
{"sheet":"ICT Provision Report","index":9,"n_rows":33,"n_cols":12,"rows_kept":33,"cut":false,"hidden":true,"merged":[[16,8,17,8],[16,0,17,3],[0,10,0,11],[0,4,0,8],[1,4,1,8],[16,4,16,6],[16,7,17,7]]}
[null,null,null,null,{"$f":"Introduction!E5","v":0},null,null,null,null,null,{"$f":"NOW()","v":"2016-10-31T11:08:05.270"}]
[null,null,null,null,"ICT Status Report"]
[]
["Summary of Provision",null,null,null,"No of Services","No of Physical Servers","No of Virtualised Servers","Storage Capacity TB","Bandwidth Requirements Mbps","Legacy Servers","Annual Colocation Costs","Annual Managed Service Costs"]
["Server in own datacentre",null,null,null,{"$f":"COUNTIF('ICT Requirements'!$C$19:$L$19,'ICT Provision Report'!A5)","v":0},{"$f":"SUMIF('ICT Requirements'!$C$19:$L$19,'ICT Provision Report'!A5,'ICT Requirements'!$C$24:$L$24)","v":0},null,null,{"$f":"SUMIF('ICT Requirements'!$C$19:$L$19,'ICT Provision Report'!A5,'ICT Requirements'!$C$35:$L$35)*1000","v":0},{"$f":"SUMIFS('ICT Requirements'!$C$24:$L$24,'ICT Requirements'!$C$19:$L$19,'ICT Provision Report'!A5,'ICT Requirements'!$C$48:$L$48,\"Yes\")","v":0}]
["Colocated server",null,null,null,{"$f":"COUNTIF('ICT Requirements'!$C$19:$L$19,'ICT Provision Report'!A6)","v":0},{"$f":"SUMIF('ICT Requirements'!$C$19:$L$19,'ICT Provision Report'!A6,'ICT Requirements'!$C$24:$L$24)","v":0},null,null,{"$f":"SUMIF('ICT Requirements'!$C$19:$L$19,'ICT Provision Report'!A6,'ICT Requirements'!$C$35:$L$35)*1000","v":0},{"$f":"SUMIFS('ICT Requirements'!$C$24:$L$24,'ICT Requirements'!$C$19:$L$19,'ICT Provision Report'!A6,'ICT Requirements'!$C$48:$L$48,\"Yes\")","v":0}]
["Virtualised server in own datacentre",null,null,null,{"$f":"COUNTIF('ICT Requirements'!$C$19:$L$19,'ICT Provision Report'!A7)","v":0},{"$f":"SUMIF('ICT Requirements'!$C$19:$L$19,'ICT Provision Report'!A7,'ICT Requirements'!$C$24:$L$24)","v":0},null,null,{"$f":"SUMIF('ICT Requirements'!$C$19:$L$19,'ICT Provision Report'!A7,'ICT Requirements'!$C$35:$L$35)*1000","v":0},{"$f":"SUMIFS('ICT Requirements'!$C$24:$L$24,'ICT Requirements'!$C$19:$L$19,'ICT Provision Report'!A7,'ICT Requirements'!$C$48:$L$48,\"Yes\")","v":0}]
["Virtualised colocated server",null,null,null,{"$f":"COUNTIF('ICT Requirements'!$C$19:$L$19,'ICT Provision Report'!A8)","v":0},{"$f":"SUMIF('ICT Requirements'!$C$19:$L$19,'ICT Provision Report'!A8,'ICT Requirements'!$C$24:$L$24)","v":0},null,null,{"$f":"SUMIF('ICT Requirements'!$C$19:$L$19,'ICT Provision Report'!A8,'ICT Requirements'!$C$35:$L$35)*1000","v":0},{"$f":"SUMIFS('ICT Requirements'!$C$24:$L$24,'ICT Requirements'!$C$19:$L$19,'ICT Provision Report'!A8,'ICT Requirements'!$C$48:$L$48,\"Yes\")","v":0}]
{"$rows_left_out":26}
{"sheet":"Defaults","index":10,"n_rows":44,"n_cols":37,"rows_kept":44,"cut":false,"hidden":true,"merged":[]}
["Cost Default Data Entry"]
[]
["Depreciation"]
["    ICT Equipment Life",5,"Years"]
[]
[]
["General Costs"]
["   Insurance",2.5,"per m2 per annum"]
{"$rows_left_out":37}
{"sheet":"Look Up Tables","index":11,"n_rows":126,"n_cols":13,"rows_kept":126,"cut":false,"hidden":true,"merged":[[31,1,31,4],[31,5,31,8],[31,9,31,12],[32,1,32,2],[32,3,32,4],[32,5,32,6],[32,7,32,8],[32,9,32,10],[32,11,32,12]]}
["PUE Calculation Data"]
[]
[]
["Lighting"]
[]
["Type","W/m2"]
["LED",4]
["T12 Fluorescent",30]
{"$rows_left_out":119}
{"sheet":"Graphs","index":12,"n_rows":54,"n_cols":13,"rows_kept":54,"cut":false,"hidden":true,"merged":[]}
["Graphs and Graphics"]
[]
["Report Graphs","Data Centre 1",null,null,"Data Centre 2",null,null,"Data Centre 3",null,null,"Data Centre 4"]
[null,0,9,null,0,9,null,0,9,null,0,9]
[null,{"$f":"'Data Centre Detail'!D133*45","v":0},9,null,{"$f":"'Data Centre Detail'!G133*45","v":0},9,null,{"$f":"'Data Centre Detail'!J133*45","v":0},9,null,{"$f":"'Data Centre Detail'!M133*45","v":0},9]
[null,3,9,{"$f":"'Data Centre Detail'!D133","v":0},3,9,{"$f":"'Data Centre Detail'!G133","v":0},3,9,{"$f":"'Data Centre Detail'!J133","v":0},3,9,{"$f":"'Data Centre Detail'!M133","v":0}]
[null,{"$f":"360-SUM(B4:B6)","v":357},9,null,{"$f":"360-SUM(E4:E6)","v":357},9,null,{"$f":"360-SUM(H4:H6)","v":357},9,null,{"$f":"360-SUM(K4:K6)","v":357},9]
[null,null,9,null,null,9,null,null,9,null,null,9]
{"$rows_left_out":47}
{"sheet":"Scenario History","index":13,"n_rows":323,"n_cols":86,"rows_kept":323,"cut":false,"hidden":true,"merged":[]}
[null,null,1,0,".",".",".",".",".",".",".",".",".",".",1,{"$f":"O1","v":1},null,null,null,null,null,null,null,null,null,null,{"$f":"C1+1","v":2},{"$f":"AA1","v":2},".",".",".",".",".",".",".",".",".",".",{"$f":"AA1+1","v":3},{"$f":"AM1","v":3},".",".",".",".",".",".",".",".",".",".",{"$f":"AM1+1","v":4},{"$f":"AY1","v":4},".",".",".",".",".",".",".",".",".",".",{"$f":"AY1+1","v":5},{"$f":"BK1","v":5},".",".",".",".",".",".",".",".",".",".",{"$f":"BK1+1","v":6},{"$f":"BW1","v":6},".",".",".",".",".",".",".",".",".","."]
[null,"Scenario Name:",{"$f":"Introduction!E11","v":0},null,null,null,null,null,null,null,null,null,null,null,0,null,null,null,null,null,null,null,null,null,null,null,0,null,null,null,null,null,null,null,null,null,null,null,0,null,null,null,null,null,null,null,null,null,null,null,0,null,null,null,null,null,null,null,null,null,null,null,0,null,null,null,null,null,null,null,null,null,null,null,0]
[null,null,{"$f":"D1","v":0},null,null,null,null,null,null,null,null,null,null,null,0,null,null,null,null,null,null,null,null,null,null,null,0,null,null,null,null,null,null,null,null,null,null,null,0,null,null,null,null,null,null,null,null,null,null,null,0,null,null,null,null,null,null,null,null,null,null,null,0,null,null,null,null,null,null,null,null,null,null,null,0]
[null,"Organisation name",{"$f":"Introduction!E5","v":0},null,null,null,null,null,null,null,null,null,null,null,0,null,null,null,null,null,null,null,null,null,null,null,0,null,null,null,null,null,null,null,null,null,null,null,0,null,null,null,null,null,null,null,null,null,null,null,0,null,null,null,null,null,null,null,null,null,null,null,0,null,null,null,null,null,null,null,null,null,null,null,0]
[null,"User name",{"$f":"Introduction!E6","v":0},"Utility costs","Tariff",null,"Real Escalation",null,null,null,null,null,null,null,0,"Utility costs","Tariff",null,"Real Escalation",null,null,null,null,null,null,null,0,"Utility costs","Tariff",null,"Real Escalation",null,null,null,null,null,null,null,0,"Utility costs","Tariff",null,"Real Escalation",null,null,null,null,null,null,null,0,"Utility costs","Tariff",null,"Real Escalation",null,null,null,null,null,null,null,0,"Utility costs","Tariff",null,"Real Escalation",null,null,null,null,null,null,null,0,"Utility costs","Tariff",null,"Real Escalation"]
[null,"User email",{"$f":"Introduction!E7","v":0},"  Electricity",{"$f":"Introduction!M6","v":0},"p/kWh",{"$f":"Introduction!O6","v":0.04},null,null,null,null,null,null,null,0,"  Electricity",0,"p/kWh",0.04,null,null,null,null,null,null,null,0,"  Electricity",0,"p/kWh",0.04,null,null,null,null,null,null,null,0,"  Electricity",0,"p/kWh",0.04,null,null,null,null,null,null,null,0,"  Electricity",0,"p/kWh",0.04,null,null,null,null,null,null,null,0,"  Electricity",0,"p/kWh",0.03,null,null,null,null,null,null,null,0,"  Electricity",0,"p/kWh",0.03]
[null,"No of ICT users",{"$f":"Introduction!E8","v":0},"  Natural Gas",{"$f":"Introduction!M7","v":0},"p/kWh",{"$f":"Introduction!O7","v":0.04},null,null,null,null,null,null,null,0,"  Natural Gas",0,"p/kWh",0.04,null,null,null,null,null,null,null,0,"  Natural Gas",0,"p/kWh",0.04,null,null,null,null,null,null,null,0,"  Natural Gas",0,"p/kWh",0.04,null,null,null,null,null,null,null,0,"  Natural Gas",0,"p/kWh",0.04,null,null,null,null,null,null,null,0,"  Natural Gas",0,"p/kWh",0.02,null,null,null,null,null,null,null,0,"  Natural Gas",0,"p/kWh",0.02]
[null,"No of data centres",{"$f":"Introduction!E9","v":1},"  Generator Fuel",{"$f":"Introduction!M8","v":0},"p/kWh",{"$f":"Introduction!O8","v":0.04},null,null,null,null,null,null,null,0,"  Generator Fuel",0,"p/kWh",0.04,null,null,null,null,null,null,null,0,"  Generator Fuel",0,"p/kWh",0.04,null,null,null,null,null,null,null,0,"  Generator Fuel",0,"p/kWh",0.04,null,null,null,null,null,null,null,0,"  Generator Fuel",0,"p/kWh",0.04,null,null,null,null,null,null,null,0,"  Generator Fuel",0,"p/kWh",0.02,null,null,null,null,null,null,null,0,"  Generator Fuel",0,"p/kWh",0.02]
{"$rows_left_out":315}